program: Gaussian 09
title: 000045446
version: EM64L-G09RevD.01
frameworkgroup: C1[X(C11H17NO)]
method: RPBEPBE
basis: SDD
operation: Freq
keyword: #p
keyword: freq=noraman
keyword: PBEPBE/SDD
title: #p freq=noraman PBEPBE/SDD
converged: YES YES NO NO
title: Mulliken charges:
elementType: O N C C C C C C C C C C C H H H H H H H H H H H H H H H H H
charge: -0.437776 -0.312475 -0.028305 -0.611301 0.499139 -0.708846 -0.363538 -0.395647 -0.428768 -0.330278 -0.233817 -0.228005 -0.242909 0.201779 0.193751 0.232777 0.239133 0.237164 0.220757 0.216491 0.162612 0.235273 0.228678 0.235873 0.239386 0.171408 0.223513 0.224724 0.227856 0.331349
chargesum: 0.00000
title: Mulliken charges with hydrogens summed into heavy atoms:
elementType: O N C C C C C C C C C C C
charge: -0.106427 -0.073341 0.173474 -0.184772 0.499139 -0.034433 0.034347 -0.166969 -0.192895 0.080516 -0.010305 -0.003280 -0.015053
polarizability: 1.72222664e+02 2.84079500e+00 1.19481602e+02 1.13799058e+01 -7.46420269e+00 9.01032776e+01
1716.lowfreq: -14.9726 -8.1720 -0.0005 0.0002 0.0002 2.9288 32.4776 37.9655 52.7718
frequency: 32.3791 36.5486 52.7705 66.4866 78.8919 122.4574 141.0854 216.0087 230.0692 246.4439 302.1099 329.1806 348.5119 403.3722 409.6415 439.8750 474.9647 518.4245 598.5078 617.7391 668.9221 705.6856 753.3395 815.6701 821.5208 840.4220 852.6222 890.8069 917.3439 939.0666 969.3915 973.9542 990.1026 993.9233 1026.5340 1042.5434 1049.2159 1058.5313 1074.2428 1101.9715 1138.8158 1155.6368 1171.5473 1173.9368 1186.8212 1211.7169 1221.5101 1264.6820 1273.5185 1296.2468 1319.7930 1330.3176 1343.7522 1352.3359 1378.6992 1381.9118 1387.1661 1439.0621 1460.7557 1469.3692 1470.2386 1474.7142 1481.8821 1483.9823 1492.4476 1592.3200 1614.1339 2811.4500 2839.6732 2930.9015 2958.7283 2985.1918 3042.4961 3046.8849 3081.3755 3090.9115 3100.3434 3112.0977 3118.3242 3131.8276 3143.2654 3161.8390 3406.8495 3556.2087
redmass: 4.6149 2.9218 2.5047 3.2039 2.7845 3.7063 2.3801 1.3691 5.0661 2.7585 2.0472 1.3548 2.2577 2.8169 2.4768 3.2924 3.1038 2.8219 4.3477 6.2902 1.4255 1.7688 1.8684 2.5527 1.2928 2.4678 1.2532 1.3931 1.5142 2.2308 3.1367 1.3891 6.2391 1.3107 2.1958 1.6243 2.9602 1.8383 1.9355 1.5358 1.6834 2.5021 1.0586 1.5942 1.1175 1.6167 2.1214 1.2333 1.1878 1.2267 1.3356 1.2969 1.4285 1.2903 1.2825 6.2871 1.3144 2.1454 1.1733 1.1578 1.0799 1.0791 1.1098 2.0849 1.0865 6.0480 6.1935 1.0719 1.0810 1.0712 1.0647 1.0356 1.0960 1.0854 1.0991 1.0995 1.0936 1.0871 1.0864 1.0910 1.0959 1.1015 1.0733 1.0661
irintensity: 0.7012 2.0768 4.9009 0.9473 1.3614 2.4007 3.8936 0.4788 0.8670 2.6021 34.0478 133.8051 1.0329 0.0101 8.9262 27.8656 2.0846 30.0590 12.6389 0.1872 57.6856 48.6575 52.1564 0.7709 5.1527 3.1196 0.0872 0.4727 5.4497 8.0317 103.3316 0.7622 0.0089 0.4151 8.0198 2.0886 12.0850 27.8165 8.8367 7.3233 11.7740 42.4158 0.7701 27.0358 0.6511 4.7516 7.7339 29.1185 3.1656 4.9026 23.1755 22.6420 18.7582 4.8372 21.9739 0.4095 14.6741 7.5366 23.9888 13.2964 0.5089 7.5228 10.4751 14.1470 6.7379 1.3466 8.0813 126.5568 97.1568 74.5830 44.3354 17.2331 16.4493 27.2640 39.5985 28.0259 26.4936 10.9915 4.9944 12.2942 45.7308 23.1877 3.8927 7.5157
temp: 298.150 k
press: 1.00000 atm
elementType: 8 7 6 6 6 6 6 6 6 6 6 6 6 1 1 1 1 1 1 1 1 1 1 1 1 1 1 1 1 1
symmnumber: 1
zpe: 677307.4 jmol-1
zpe.correction: 0.257973 hartree
zpe.thermalcorrener: 0.272024 hartree
zpe.thermalcorrenthalpy: 0.272968 hartree
zpe.thermalcorrgfe: 0.215390 hartree
zpe.sumelectzpe: -558.312037 hartree
zpe.sumelectthermal: -558.297986 hartree
zpe.sumelectthermalent: -558.297042 hartree
zpe.sumelectthermalfe: -558.354620 hartree
dipole: -1.6834 2.0376 -0.1525
dipole: 2.6475
quadrupole: -93.2895 -72.8965 -80.8659
quadrupole: 9.5270 2.0647 -1.6100
quadrupole: -10.9389 9.4541 1.4847 9.5270 2.0647 -1.6100
hfenergy: -558.5700102 hartree
pointgroup: C01 [X(C11H17N1O1)]
dipole: -0.6894153 0.7348181 -0.2639631 debye
polarizability: 171.9710796|7.5502471|114.045132|9.9669716|-13.6502027|95.7913317 unknown
InChI: InChI=1S/C11H17NO/c1-10(12-7-8-13)9-11-5-3-2-4-6-11/h2-6,10,12-13H,7-9H2,1H3
charge 0 multiplicity 1
30 atoms
O  5.86176 0.402367 -0.529118
N  2.231269 0.123891 0.494465
C  0.892445 -0.106729 -0.110581
C  -0.172279 0.124438 1.003112
C  -1.604357 0.107535 0.491558
C  0.793513 -1.527223 -0.702448
C  3.381632 0.139284 -0.429499
C  -2.109708 1.193743 -0.271341
C  -2.463301 -0.992039 0.746298
C  4.685659 0.389885 0.351569
C  -3.431633 1.180467 -0.768578
C  -3.788108 -1.010673 0.251861
C  -4.276845 0.075701 -0.509233
H  0.687529 0.626847 -0.933351
H  0.036713 1.107325 1.476847
H  -0.022413 -0.646828 1.78136
H  2.220469 0.970672 1.082865
H  -0.232283 -1.722349 -1.060377
H  1.052642 -2.273757 0.070326
H  1.477771 -1.663464 -1.558553
H  3.283806 0.913749 -1.238781
H  3.463751 -0.840003 -0.932667
H  -1.464251 2.059467 -0.468475
H  -2.091261 -1.837135 1.338559
H  4.866608 -0.432668 1.060378
H  4.612727 1.340531 0.92793
H  -3.804815 2.029702 -1.352582
H  -4.436992 -1.868638 0.462094
H  -5.303726 0.064628 -0.891629
H  5.744782 1.112172 -1.210611
