program: Gaussian 09
title: 000005311
version: EM64L-G09RevD.01
frameworkgroup: C1[X(C14H20N2O3)]
method: RPBEPBE
basis: SDD
operation: Freq
keyword: #p
keyword: freq=noraman
keyword: PBEPBE/SDD
title: #p freq=noraman PBEPBE/SDD
converged: YES YES NO NO
title: Mulliken charges:
elementType: O O O N N C C C C C C C C C C C C C C H H H H H H H H H H H H H H H H H H H H
charge: -0.254130 -0.327441 -0.379419 -0.459962 -0.327601 -0.368619 -0.369251 -0.369132 -0.370566 -0.563567 -0.504690 0.204740 0.288415 0.483802 -0.448509 -0.347108 -0.197587 -0.214807 -0.254515 0.194973 0.192520 0.194069 0.196077 0.203608 0.242083 0.239327 0.204770 0.211985 0.237775 0.236029 0.205756 0.302169 0.331643 0.217989 0.308482 0.226283 0.226893 0.229053 0.378462
chargesum: 0.00000
title: Mulliken charges with hydrogens summed into heavy atoms:
elementType: O O O N N C C C C C C C C C C C C C C
charge: -0.254130 -0.327441 -0.000957 -0.157793 0.004042 0.018874 0.020895 0.076559 0.073531 -0.113807 -0.062905 0.204740 0.288415 0.483802 -0.230520 -0.038626 0.028696 0.012087 -0.025462
polarizability: 2.78802201e+02 5.76936064e+00 1.67382942e+02 -1.97953272e+01 4.10792228e-01 1.02266539e+02
1716.lowfreq: -3.8944 -0.0007 0.0007 0.0012 1.8554 8.7340 10.5259 18.0868 28.8387
frequency: 9.3740 17.0168 28.7480 30.4902 59.5974 68.1771 70.2699 86.8776 109.6299 130.2444 136.7461 152.5673 159.9975 195.1594 233.4716 259.0126 275.8004 309.4768 336.9649 361.4566 376.2965 407.3914 429.4002 450.5103 507.9434 509.2820 543.4662 613.6364 621.5412 622.7596 647.4506 697.3580 720.1721 725.3407 730.5069 745.6719 769.7279 786.4329 825.4483 843.5654 867.8160 918.7719 927.7394 932.7770 961.9407 972.9705 984.6532 985.8660 1001.6639 1009.2993 1025.9052 1031.5302 1071.0334 1074.7434 1080.4045 1086.4596 1089.0746 1105.9487 1172.2057 1178.6845 1187.3313 1199.4669 1223.4969 1228.3575 1255.6585 1265.7909 1270.2330 1287.3581 1294.6497 1296.7356 1308.3448 1322.0886 1340.6273 1356.2514 1359.1319 1367.8723 1384.7127 1425.8757 1443.7670 1445.3535 1464.6823 1466.8680 1479.2341 1484.3365 1487.7380 1490.5860 1507.8371 1573.6413 1598.8490 1614.3214 1623.7106 2952.4901 2958.9454 2966.7668 2976.1386 2983.1096 2986.1011 2993.1840 3016.1849 3021.0560 3029.9174 3058.0512 3063.3824 3107.5910 3131.9589 3143.9955 3165.1117 3195.0097 3219.6459 3527.7718 3620.3542
redmass: 5.7732 5.1692 4.8419 5.5692 5.4490 3.3089 2.8534 2.8619 3.9212 2.4447 2.2208 5.5311 3.3086 5.4275 4.0135 4.2014 4.3490 4.4246 5.8796 2.0824 2.1151 2.9158 3.4562 2.6534 2.8147 1.1820 3.7363 6.2465 2.7657 4.5061 1.1710 1.9725 4.0177 2.1302 1.5163 1.2310 1.7049 1.3870 3.6681 1.2710 1.5106 1.4356 5.8731 4.6819 1.7044 1.3508 6.1425 3.6728 1.3080 5.0315 2.3028 3.1126 2.6374 4.1264 2.2120 1.6173 1.5638 1.2898 1.0575 2.2298 1.1145 1.4445 1.3783 1.3630 1.8759 1.3182 1.2911 1.0643 1.1692 1.1332 1.3685 1.4265 1.4690 1.5508 1.6687 2.1311 6.0611 2.3728 1.1016 1.1184 1.0657 1.0827 1.0944 2.3217 1.1081 1.9592 2.1692 3.5843 6.3938 5.5369 4.8339 1.0588 1.0593 1.0589 1.0594 1.0661 1.0630 1.0937 1.0975 1.1012 1.1010 1.1035 1.1035 1.0887 1.0867 1.0934 1.0998 1.0952 1.0631 1.0762 1.0830
irintensity: 0.5688 4.4655 5.4592 0.0911 5.1907 0.5578 2.4190 0.4242 0.8240 0.3209 0.4381 0.3875 1.6726 10.3683 24.1443 14.4937 32.4189 4.3847 4.1000 35.3594 33.9616 0.0181 0.8283 34.0239 13.3359 176.4261 12.1905 0.7938 6.8285 0.3050 36.9260 53.0468 1.1373 8.0251 7.6522 0.8083 89.7407 8.0334 2.5829 0.1665 0.7759 13.9166 29.2770 7.3829 15.6742 0.1705 1.4741 45.2539 3.2295 17.3521 0.9961 11.9835 9.6286 6.1565 4.8759 25.9114 9.6791 8.6981 0.9165 45.2766 2.9740 7.2926 48.9351 0.7039 37.0676 4.5624 3.3601 5.7712 12.8573 10.3716 29.0449 24.0372 54.2003 5.6929 0.0985 175.0872 75.5529 113.3566 7.7169 18.8348 0.1150 2.2981 0.7392 51.0169 36.1030 71.9498 362.3684 92.2664 58.8125 58.7971 85.4734 0.4084 38.2717 15.5939 7.2496 10.4791 80.0897 0.1119 39.3835 0.9645 0.7550 3.1038 120.0173 15.8336 0.3951 31.0390 25.5374 8.2268 29.1174 10.5380 64.4275
temp: 298.150 k
press: 1.00000 atm
elementType: 8 8 8 7 7 6 6 6 6 6 6 6 6 6 6 6 6 6 6 1 1 1 1 1 1 1 1 1 1 1 1 1 1 1 1 1 1 1 1
symmnumber: 1
zpe: 844899.4 jmol-1
zpe.correction: 0.321805 hartree
zpe.thermalcorrener: 0.342048 hartree
zpe.thermalcorrenthalpy: 0.342992 hartree
zpe.thermalcorrgfe: 0.268001 hartree
zpe.sumelectzpe: -879.198316 hartree
zpe.sumelectthermal: -879.178073 hartree
zpe.sumelectthermalent: -879.177129 hartree
zpe.sumelectthermalfe: -879.252120 hartree
dipole: 1.6474 0.4976 -0.0959
dipole: 1.7236
quadrupole: -131.2080 -109.7326 -116.9306
quadrupole: 28.5380 -1.1191 2.5532
quadrupole: -11.9175 9.5578 2.3598 28.5380 -1.1191 2.5532
hfenergy: -879.5201209 hartree
pointgroup: C01 [X(C14H20N2O3)]
dipole: -0.6485704 -0.1299008 -0.149363 debye
polarizability: 278.3674937|-8.5123257|145.7061334|20.7988659|30.4797935|124.3780548 unknown
InChI: InChI=1S/C14H20N2O3/c17-13(15-12-8-4-3-5-9-12)10-6-1-2-7-11-14(18)16-19/h3-5,8-9,15-16,19H,1-2,6-7,10-11H2
charge 0 multiplicity 1
39 atoms
O  -2.341539 0.975449 1.256511
O  6.928801 -1.05634 -1.017886
O  9.014083 -0.233242 0.38941
N  -3.314123 -0.653918 -0.128391
N  7.746877 0.442567 0.48573
C  1.64559 -0.546731 0.218662
C  2.828561 0.422383 -0.005297
C  0.274942 0.161693 0.164709
C  4.199314 -0.285045 0.057532
C  -0.906654 -0.812268 0.382097
C  5.379533 0.693811 -0.161622
C  -2.24014 -0.069642 0.546993
C  6.707253 -0.037017 -0.271156
C  -4.683297 -0.255535 -0.153677
C  -5.578781 -1.050126 -0.920661
C  -5.172722 0.881056 0.544698
C  -6.946035 -0.716274 -0.990174
C  -6.545654 1.200809 0.464362
C  -7.43986 0.41353 -0.296547
H  1.685534 -1.352044 -0.544357
H  1.761597 -1.044405 1.204307
H  2.715099 0.917001 -0.992648
H  2.785788 1.229517 0.755514
H  0.155919 0.674104 -0.811043
H  0.218298 0.94677 0.941834
H  4.257885 -1.07622 -0.713465
H  4.315628 -0.7886 1.038034
H  -0.952798 -1.55315 -0.441012
H  -0.729484 -1.382446 1.317131
H  5.219671 1.243889 -1.11029
H  5.413107 1.448578 0.649071
H  -3.093467 -1.488795 -0.676455
H  7.769895 1.217894 1.144656
H  -5.204174 -1.929406 -1.461705
H  -4.479607 1.487018 1.130479
H  -7.624111 -1.338091 -1.585112
H  -6.916834 2.078542 1.00544
H  -8.502225 0.674022 -0.34956
H  8.779135 -0.956636 -0.282611
