program: Gaussian 09
title: 000045407
version: EM64L-G09RevD.01
frameworkgroup: C1[X(C10H21NO2)]
method: RPBEPBE
basis: SDD
operation: Freq
keyword: #p
keyword: freq=noraman
keyword: PBEPBE/SDD
title: #p freq=noraman PBEPBE/SDD
converged: YES YES NO NO
title: Mulliken charges:
elementType: O O N C C C C C C C C C C H H H H H H H H H H H H H H H H H H H H H
charge: -0.268783 -0.244876 -0.105102 -0.337657 -0.385288 -0.321880 -0.323934 -0.500343 -0.673722 -0.676414 0.247030 -0.225150 -0.672782 0.175946 0.197915 0.225783 0.226046 0.203884 0.183805 0.209748 0.184850 0.228684 0.244060 0.207334 0.229085 0.205594 0.205670 0.230138 0.205828 0.226442 0.228231 0.210919 0.229751 0.229185
chargesum: 0.00000
title: Mulliken charges with hydrogens summed into heavy atoms:
elementType: O O N C C C C C C C C C C
charge: -0.268783 -0.244876 -0.105102 0.036204 0.066541 0.065810 0.070664 -0.027599 -0.031709 -0.034778 0.247030 0.229524 -0.002927
polarizability: 1.59668249e+02 3.03931661e+00 1.20894451e+02 -8.02592777e-01 2.21705821e+00 9.90244888e+01
1716.lowfreq: -5.5467 -3.2521 -0.0005 0.0002 0.0003 8.8388 17.3072 27.6656 44.1629
frequency: 17.1872 27.6197 44.1153 58.2515 70.4210 83.7976 88.6454 104.1320 155.0535 165.3613 189.3154 213.2497 227.5283 254.4533 286.9301 289.8764 312.8673 350.3200 392.0540 426.8349 467.6561 490.3532 575.9780 684.6933 739.1106 751.9990 796.3494 797.5902 798.8472 807.8178 850.6156 911.8338 918.5176 990.0125 1021.6081 1045.0560 1057.6346 1063.5993 1074.3794 1082.6239 1085.4006 1100.1394 1113.8035 1131.5009 1135.9121 1162.0994 1204.1056 1212.2376 1247.8667 1263.1624 1272.3021 1281.1338 1291.4437 1294.9203 1341.3965 1360.5113 1361.2932 1367.2062 1380.5737 1387.1712 1388.3132 1401.0559 1444.6697 1460.4952 1463.3679 1463.7920 1471.0438 1474.2028 1474.6003 1479.2251 1484.5300 1486.7114 1486.9658 1490.4978 1638.1582 2829.3335 2843.6548 2857.1314 2972.4261 2982.2490 2983.2987 2995.2410 3008.9090 3009.6176 3021.2439 3032.8439 3034.6814 3052.1582 3066.8988 3073.3487 3075.5739 3078.8184 3091.6919 3091.8606 3093.3173 3106.7458
redmass: 4.5143 3.2076 3.0990 2.7363 2.2286 2.5734 2.1062 2.1986 2.0229 2.2992 1.9199 1.8623 1.4280 1.3114 2.0611 2.3042 2.4851 3.7506 2.9991 3.0359 2.6227 2.8615 3.2831 4.7765 1.5967 1.7545 1.1561 1.2384 1.1007 2.9636 1.4904 5.4574 1.8813 2.2816 2.3453 3.2636 3.0470 1.8526 1.8889 2.6408 2.1366 1.9705 2.1911 1.9949 1.5193 1.8570 2.1616 1.8171 1.1380 1.3450 1.1822 1.1325 1.2480 1.2283 1.4177 1.4626 1.3362 1.3800 1.4488 1.2331 1.2313 1.2680 1.0862 1.0619 1.0554 1.0403 1.0561 1.0635 1.0621 1.0540 1.0806 1.0699 1.0706 1.0751 9.8708 1.0715 1.0723 1.0713 1.0656 1.0359 1.0357 1.0359 1.0584 1.0605 1.0849 1.0865 1.0880 1.0946 1.1066 1.0986 1.0979 1.1014 1.0985 1.1002 1.1003 1.1025
irintensity: 1.0934 0.3744 0.1228 0.5878 0.0830 0.8366 0.1248 0.4113 1.8313 5.9268 2.0468 2.8495 0.1305 1.4812 6.3995 3.4246 1.3398 8.8621 2.0176 2.4641 8.8275 8.4162 8.0013 2.6197 16.0141 3.6596 5.4203 8.8807 4.1069 4.8615 0.7257 32.2895 2.5194 5.5348 49.4991 38.1995 3.9640 31.1389 20.8221 13.9328 10.5422 109.6509 2.1321 127.9299 22.2696 154.0841 16.6244 21.6335 0.4614 50.6086 1.7419 4.8300 40.3918 46.3289 29.0807 14.1605 6.3615 0.9476 1.6709 21.9156 20.6859 18.4488 15.6810 1.9459 5.5317 11.7483 1.5833 5.3246 1.0363 5.5666 10.6567 2.6390 27.5433 13.6602 164.0258 61.1128 33.2691 239.7209 13.0041 34.5117 30.8454 22.9966 15.0358 20.2668 20.7356 11.2288 21.5663 1.0451 8.3304 32.1044 73.9159 60.9032 27.8625 40.0489 44.9998 46.3320
temp: 298.150 k
press: 1.00000 atm
elementType: 8 8 7 6 6 6 6 6 6 6 6 6 6 1 1 1 1 1 1 1 1 1 1 1 1 1 1 1 1 1 1 1 1 1
symmnumber: 1
zpe: 784075.2 jmol-1
zpe.correction: 0.298638 hartree
zpe.thermalcorrener: 0.315612 hartree
zpe.thermalcorrenthalpy: 0.316556 hartree
zpe.thermalcorrgfe: 0.251206 hartree
zpe.sumelectzpe: -597.763893 hartree
zpe.sumelectthermal: -597.746920 hartree
zpe.sumelectthermalent: -597.745975 hartree
zpe.sumelectthermalfe: -597.811326 hartree
dipole: 0.4690 1.5789 1.1438
dipole: 2.0053
quadrupole: -67.0960 -85.7739 -81.5469
quadrupole: 2.0142 -2.5955 -1.5778
quadrupole: 11.0430 -7.6350 -3.4080 2.0142 -2.5955 -1.5778
hfenergy: -598.0625319 hartree
pointgroup: C01 [X(C10H21N1O2)]
dipole: 0.1796205 0.6461835 0.4154587 debye
polarizability: 159.5830446|3.4316645|121.1398454|-1.3190406|1.0171377|98.8642993 unknown
InChI: InChI=1S/C10H21NO2/c1-4-11(5-2)9-7-8-10(12)13-6-3/h4-9H2,1-3H3
charge 0 multiplicity 1
34 atoms
O  3.407127 0.443728 0.161014
O  2.305046 -1.589795 -0.118582
N  -2.772462 0.042388 0.127105
C  -1.494051 0.524935 0.707636
C  -0.258682 -0.119922 0.044332
C  -3.874935 1.033653 0.252137
C  -3.155189 -1.305853 0.63022
C  1.056076 0.40052 0.665901
C  -3.755388 2.196274 -0.752274
C  -4.055038 -2.080537 -0.351801
C  2.273264 -0.375898 0.191483
C  4.686343 -0.222293 -0.23976
C  5.776366 0.842476 -0.175878
H  -1.452789 0.352699 1.816031
H  -1.44111 1.6204 0.562101
H  -0.285357 0.097038 -1.039199
H  -0.28701 -1.220098 0.145453
H  -4.825858 0.504175 0.060564
H  -3.944443 1.438624 1.294817
H  -2.227342 -1.886041 0.784605
H  -3.65465 -1.238668 1.631034
H  1.010413 0.292217 1.770418
H  1.213412 1.474459 0.463186
H  -2.830033 2.781225 -0.600109
H  -3.742561 1.803828 -1.783902
H  -4.610229 2.890352 -0.645418
H  -5.012945 -1.560307 -0.534616
H  -3.541563 -2.197037 -1.32179
H  -4.290737 -3.084235 0.049146
H  4.872261 -1.063521 0.452563
H  4.556455 -0.637909 -1.255412
H  6.748167 0.401649 -0.464247
H  5.554987 1.675708 -0.864592
H  5.869356 1.250768 0.845033
