program: Gaussian 09
title: 000005308
version: EM64L-G09RevD.01
frameworkgroup: C1[X(C15H13ClN2O)]
method: RPBEPBE
basis: SDD
operation: Freq
keyword: #p
keyword: freq=noraman
keyword: PBEPBE/SDD
title: #p freq=noraman PBEPBE/SDD
converged: YES YES NO NO
title: Mulliken charges:
elementType: Cl O N N C C C C C C C C C C C C C C C H H H H H H H H H H H H H
charge: -0.080099 -0.345664 -0.461233 -0.447665 0.190493 0.186645 0.238033 0.263250 0.236917 -0.405350 0.339578 0.072353 -0.522809 -0.356111 -0.342071 -0.817156 -0.797076 -0.128555 -0.215510 0.230424 0.395558 0.260087 0.323378 0.252758 0.238782 0.236377 0.232742 0.236072 0.244497 0.244609 0.243900 0.252845
chargesum: 0.00000
title: Mulliken charges with hydrogens summed into heavy atoms:
elementType: Cl O N N C C C C C C C C C C C C C C C
charge: -0.080099 -0.345664 -0.065675 -0.124287 0.190493 0.186645 0.238033 0.263250 0.236917 -0.174926 0.339578 0.072353 -0.262723 -0.103353 -0.103289 -0.111965 -0.064069 -0.128555 0.037335
polarizability: 4.09255807e+02 2.18539245e+01 2.16091270e+02 -2.29293781e-02 1.30470092e-01 8.17648500e+01
1716.lowfreq: -4.1745 -0.0008 -0.0005 0.0007 1.8475 3.2616 35.4669 45.1789 58.2302
frequency: 35.4124 45.1393 58.2262 61.0097 82.1842 107.8358 135.3502 147.2878 185.1794 203.8132 211.8300 249.7032 263.3010 303.9578 336.5170 341.3678 370.5373 377.3944 439.6039 447.3902 454.4039 540.0172 551.2237 572.7719 577.9076 594.3483 636.3826 640.8049 677.2678 684.1489 690.6048 731.3826 760.2808 786.6544 800.0619 819.3538 833.7015 872.5109 872.7337 917.0370 924.5686 962.6879 974.1363 984.6152 1005.3779 1006.3051 1039.0699 1045.0350 1059.1393 1109.6743 1129.4017 1167.2163 1193.6293 1210.6035 1232.6580 1266.0710 1315.4365 1327.1064 1359.7452 1378.9722 1399.5435 1405.6297 1408.2186 1413.0463 1434.6790 1454.9986 1465.8227 1466.5939 1472.2157 1479.4950 1494.1614 1512.5075 1547.0009 1581.6977 1595.7427 1624.0847 1653.0790 2974.6559 2979.1218 2988.4024 3048.6866 3052.9639 3087.3953 3102.3447 3104.3772 3147.2431 3159.0332 3177.3133 3209.3888 3596.8167
redmass: 2.1954 1.3529 3.8266 1.1063 5.9373 7.6789 5.2142 4.4010 5.4204 4.0604 3.4134 8.7292 3.7937 3.7910 13.2890 5.1997 5.1907 6.9545 3.1640 3.4230 3.2871 8.1365 4.8095 2.4372 4.3620 1.4396 3.3376 5.5977 7.3767 5.2673 6.3107 5.3287 5.3407 5.4977 1.4458 1.2924 4.3012 4.7355 1.5190 1.4640 1.3545 2.0466 2.5659 2.6253 1.4076 1.3079 1.5030 1.4269 2.1180 2.3809 2.1166 1.4837 3.0330 3.8020 1.5413 1.7163 2.0789 2.6174 1.9255 2.8165 1.2989 2.1581 1.6352 2.8906 4.1922 3.3294 1.0436 2.0718 1.0537 1.2977 2.0574 3.7249 5.1122 5.9523 4.7295 7.8159 5.2166 1.0389 1.0386 1.1004 1.0976 1.0975 1.0974 1.0975 1.0877 1.0900 1.0927 1.0958 1.0982 1.0800
irintensity: 0.1266 0.0123 3.7097 0.0124 0.1774 0.0235 0.7558 0.6595 0.1853 3.5656 1.9207 3.2414 0.0343 0.4892 3.4178 0.1900 0.2484 3.4065 0.0061 12.0484 0.0088 18.0456 13.0473 50.5562 3.3340 71.6806 1.6317 65.4068 0.2178 0.1561 33.9439 0.9154 7.1701 1.3935 57.5819 22.2266 0.7481 30.5149 19.3475 12.7170 0.1043 23.6913 24.8692 8.9676 31.5421 39.7607 8.0558 31.0199 22.7296 21.1583 4.1779 46.0708 311.2992 22.1596 18.6604 0.0213 436.5192 87.3804 41.7352 1.7323 23.1117 0.9783 10.1975 38.0004 57.8947 118.7721 13.6052 20.4211 17.5948 27.1990 0.9434 10.2758 287.8734 121.9706 241.5438 32.2990 520.9838 49.4179 39.5116 296.9557 18.1095 15.4610 23.5211 12.7253 5.3453 10.8290 1.8707 3.2739 10.9362 61.4480
temp: 298.150 k
press: 1.00000 atm
elementType: 17 8 7 7 6 6 6 6 6 6 6 6 6 6 6 6 6 6 6 1 1 1 1 1 1 1 1 1 1 1 1 1
symmnumber: 1
zpe: 640865.5 jmol-1
zpe.correction: 0.244093 hartree
zpe.thermalcorrener: 0.261128 hartree
zpe.thermalcorrenthalpy: 0.262073 hartree
zpe.thermalcorrgfe: 0.197972 hartree
zpe.sumelectzpe: -1222.905542 hartree
zpe.sumelectthermal: -1222.888506 hartree
zpe.sumelectthermalent: -1222.887562 hartree
zpe.sumelectthermalfe: -1222.951662 hartree
dipole: 2.4959 -0.7937 0.0036
dipole: 2.6190
quadrupole: -108.5913 -105.8888 -123.1384
quadrupole: 14.6390 -0.0014 0.0649
quadrupole: 3.9482 6.6507 -10.5989 14.6390 -0.0014 0.0649
hfenergy: -1223.1496344 hartree
pointgroup: C01 [X(C15H13Cl1N2O1)]
dipole: -0.9405715 0.2436295 -0.3430708 debye
polarizability: 410.1911498|16.4907956|145.8355499|14.9151723|-65.1387587|151.0852266 unknown
InChI: InChI=1S/C15H13ClN2O/c1-8-5-9(2)17-14(8)7-12-11-6-10(16)3-4-13(11)18-15(12)19/h3-7,17-18H,1-2H3
charge 0 multiplicity 1
32 atoms
Cl 4.930958 -1.51624 2.101797
O  -0.870423 1.732702 -1.831181
N  -2.781536 0.369543 -0.603329
N  1.478889 1.708423 -1.582497
C  0.338401 0.258596 -0.18155
C  1.779343 0.145912 0.074072
C  -2.077333 -0.442951 0.310406
C  2.456908 1.052059 -0.805372
C  -3.054286 -1.22476 1.022954
C  -0.66812 -0.461694 0.470312
C  -4.129854 0.133929 -0.498876
C  0.183245 1.27443 -1.255498
C  -4.322683 -0.856061 0.508454
C  2.533484 -0.644111 0.968967
C  3.85425 1.187707 -0.814018
C  -2.77119 -2.234124 2.106656
C  -5.140378 0.849803 -1.347067
C  3.935027 -0.499507 0.950266
C  4.606981 0.391325 0.086102
H  -0.325272 -1.167648 1.239854
H  -2.255419 1.030296 -1.23432
H  -5.288693 -1.252478 0.819483
H  1.65138 2.412132 -2.298938
H  2.060842 -1.34848 1.659665
H  4.364179 1.882548 -1.488962
H  -3.70197 -2.729294 2.430542
H  -2.076598 -3.024047 1.76383
H  -2.318689 -1.763101 3.000176
H  -5.097579 1.944664 -1.193234
H  -4.970729 0.664323 -2.424634
H  -6.159205 0.511111 -1.099846
H  5.697571 0.464593 0.112584
