program: Gaussian 09
title: 000005300
version: EM64L-G09RevD.01
frameworkgroup: C1[X(C8H15N3O7)]
method: RPBEPBE
basis: SDD
operation: Freq
keyword: #p
keyword: freq=noraman
keyword: PBEPBE/SDD
title: #p freq=noraman PBEPBE/SDD
converged: YES YES NO NO
title: Mulliken charges:
elementType: O O O O O O O N N N C C C C C C C C H H H H H H H H H H H H H H H
charge: -0.259855 -0.450836 -0.465548 -0.435178 -0.420242 -0.281452 -0.241791 -0.411943 -0.165653 0.044300 -0.172176 -0.044756 -0.191316 0.011567 -0.165636 -0.387690 0.325139 -0.626391 0.286123 0.300365 0.236991 0.219366 0.247116 0.234998 0.215281 0.385439 0.359890 0.360519 0.373287 0.332822 0.274962 0.253722 0.258577
chargesum: 0.00000
title: Mulliken charges with hydrogens summed into heavy atoms:
elementType: O O O O O O O N N N C C C C C C C C
charge: -0.259855 -0.090946 -0.105029 -0.061891 -0.087420 -0.281452 -0.241791 -0.026504 -0.165653 0.044300 0.113948 0.255609 0.045674 0.230933 0.081480 0.062589 0.325139 0.160870
polarizability: 1.57061200e+02 -7.34539267e+00 1.38355791e+02 -7.57703767e+00 -3.57349576e-01 1.07389917e+02
1716.lowfreq: -9.5083 -5.3271 -0.0007 -0.0005 -0.0001 8.4339 17.8644 30.4009 53.0112
frequency: 17.7301 30.3501 52.9682 77.9201 91.4008 94.8259 130.3910 140.6166 144.7250 172.1530 186.9765 202.8339 224.0059 237.7213 257.0390 266.6814 277.5569 292.0586 310.8027 324.7985 356.5785 375.4418 388.5219 410.2500 426.2348 471.8055 487.3276 511.1166 521.7831 544.1343 630.5082 658.5403 677.4037 706.9647 740.7831 769.3574 827.1968 836.1819 852.9560 894.4086 932.2071 949.0988 973.6840 977.5693 1007.9887 1033.0808 1046.2712 1059.4394 1066.4994 1096.3216 1103.6280 1116.2737 1152.0578 1174.9447 1180.1107 1194.5635 1211.7874 1245.6710 1257.2384 1268.5863 1289.9985 1296.8989 1306.4385 1320.4808 1343.5482 1352.0821 1360.7971 1362.1496 1379.1276 1383.0568 1392.9414 1407.5315 1413.1468 1452.6404 1463.5573 1470.4645 1494.4318 1652.6634 2957.4784 2986.4829 2988.6561 2996.7869 3005.5014 3015.1070 3029.7761 3089.2979 3090.1407 3147.8065 3472.4024 3508.3933 3560.0822 3575.1317 3577.4210
redmass: 7.1654 6.3235 5.2791 3.5207 5.5961 5.7404 5.4322 3.7105 1.3275 5.3095 3.8530 3.6407 6.2914 3.4882 3.4091 2.4459 1.8018 1.5922 2.5261 2.8225 3.2662 3.7952 6.1257 2.5654 3.7286 9.4517 3.8273 3.2316 1.9969 1.9385 4.6752 5.0740 1.2812 8.4190 5.2497 4.8876 3.5811 4.5352 3.4689 3.2971 3.3017 2.8609 5.2132 5.4183 2.8291 2.9652 3.4904 2.3588 3.7570 2.0694 2.8296 1.3255 2.0582 1.1604 1.3515 1.9579 1.3195 1.4148 1.2374 2.2159 1.6229 1.2159 1.2082 1.4721 1.3157 1.3521 1.5903 3.5800 1.5597 1.2665 1.5842 1.6527 1.2258 1.0814 1.0435 1.0974 1.9184 10.0545 1.0827 1.0650 1.0854 1.0853 1.0335 1.0863 1.0850 1.0987 1.1009 1.1010 1.0770 1.0647 1.0664 1.0654 1.0666
irintensity: 0.1367 0.0550 2.7860 1.6489 9.9981 5.9852 4.3849 2.5138 2.0724 5.3863 9.1237 27.3322 13.2829 19.2589 13.5386 32.1911 8.6408 138.6353 11.9331 18.3619 74.1370 72.4344 4.0144 36.9444 14.7055 2.4597 7.3028 35.8242 133.5118 107.3481 20.2435 9.5414 66.4693 30.3967 46.0674 29.7474 25.0651 12.3070 31.0566 150.3931 226.4644 89.1573 48.3440 77.2431 44.7264 104.6851 53.8232 28.7200 28.7710 11.8987 44.3193 0.4879 86.5753 18.7646 42.9124 5.2166 14.7266 7.6710 2.7840 6.0526 73.0487 16.6404 20.0736 9.1601 25.6660 20.6482 48.4119 125.7787 13.7668 10.5355 1.4568 20.6907 47.2513 6.5578 20.6267 30.4788 477.0668 217.4265 28.9316 38.6809 29.6942 10.0077 14.6894 45.7952 12.6584 14.7959 13.0509 0.2163 69.0265 23.4572 7.8673 23.2096 12.9127
temp: 298.150 k
press: 1.00000 atm
elementType: 8 8 8 8 8 8 8 7 7 7 6 6 6 6 6 6 6 6 1 1 1 1 1 1 1 1 1 1 1 1 1 1 1
symmnumber: 1
zpe: 662793.9 jmol-1
zpe.correction: 0.252445 hartree
zpe.thermalcorrener: 0.271856 hartree
zpe.thermalcorrenthalpy: 0.272800 hartree
zpe.thermalcorrgfe: 0.203820 hartree
zpe.sumelectzpe: -1003.157539 hartree
zpe.sumelectthermal: -1003.138128 hartree
zpe.sumelectthermalent: -1003.137184 hartree
zpe.sumelectthermalfe: -1003.206164 hartree
dipole: -2.0068 3.0587 -1.8234
dipole: 4.0875
quadrupole: -102.2726 -121.0931 -99.0786
quadrupole: -1.0810 -2.4352 -12.8255
quadrupole: 5.2089 -13.6117 8.4028 -1.0810 -2.4352 -12.8255
hfenergy: -1003.4099841 hartree
pointgroup: C01 [X(C8H15N3O7)]
dipole: 0.7423272 0.9375288 1.0752214 debye
polarizability: 156.8976127|9.5370658|135.5600204|-3.909582|9.573513|110.3492747 unknown
InChI: InChI=1S/C8H15N3O7/c1-11(10-17)8(16)9-4-6(14)5(13)3(2-12)18-7(4)15/h3-7,9,12-15H,2H2,1H3
charge 0 multiplicity 1
33 atoms
O  1.706234 -0.909761 -0.855036
O  1.822079 2.549775 -0.28955
O  2.53386 1.259389 2.048644
O  0.370057 -0.584826 -2.733569
O  4.324751 -2.087357 0.243459
O  -2.29389 1.89707 0.397022
O  -4.019362 -2.344902 -0.017307
N  -1.023414 0.150147 -0.513182
N  -3.24007 -0.255213 0.229722
N  -3.022713 -1.564824 -0.201862
C  0.862795 1.598285 0.286254
C  0.111624 0.98825 -0.923633
C  1.636234 0.540306 1.111703
C  2.54668 -0.322726 0.210099
C  1.101282 0.122154 -1.724604
C  3.202798 -1.481804 0.968086
C  -2.148148 0.691896 0.04236
C  -4.516015 0.16967 0.828651
H  0.135318 2.127352 0.932792
H  -0.237454 1.83193 -1.548097
H  0.924099 -0.110562 1.657435
H  3.321357 0.337737 -0.239085
H  1.907739 0.763304 -2.136677
H  2.472634 -2.299759 1.084286
H  3.51855 -1.118407 1.9671
H  -1.054722 -0.819164 -0.852343
H  2.450941 2.790728 0.442524
H  2.02915 1.518295 2.860074
H  0.968681 -1.250126 -3.158637
H  5.068449 -1.434462 0.196674
H  -4.427857 1.239521 1.06359
H  -4.719548 -0.417091 1.740984
H  -5.341518 -0.005727 0.117524
