program: Gaussian 09
title: 000045367
version: EM64L-G09RevD.01
frameworkgroup: C1[X(C13H21NO3)]
method: RPBEPBE
basis: SDD
operation: Freq
keyword: #p
keyword: freq=noraman
keyword: PBEPBE/SDD
title: #p freq=noraman PBEPBE/SDD
converged: YES YES NO NO
title: Mulliken charges:
elementType: O O O N C C C C C C C C C C C C C H H H H H H H H H H H H H H H H H H H H H
charge: -0.278469 -0.299369 -0.295252 -0.542292 0.607663 -0.560700 -0.588696 0.292429 0.026580 -0.592802 0.240799 -0.408982 -0.234589 -0.227182 -0.687779 -0.681305 -0.527366 0.201348 0.193254 0.248481 0.256966 0.226957 0.219638 0.205298 0.210232 0.204191 0.232906 0.261936 0.265200 0.226556 0.207853 0.235221 0.206614 0.230549 0.224164 0.210984 0.265141 0.223823
chargesum: 0.00000
title: Mulliken charges with hydrogens summed into heavy atoms:
elementType: O O O N C C C C C C C C C C C C C
charge: -0.278469 -0.299369 -0.295252 -0.015157 0.607663 -0.166098 -0.340214 0.292429 0.026580 -0.335836 0.240799 0.037614 0.180941 0.209916 -0.018149 -0.019978 0.172581
polarizability: 2.15170807e+02 1.84786928e+00 1.85704035e+02 -5.77527716e+00 1.50741326e+00 1.08154838e+02
1716.lowfreq: -6.5233 -0.2427 -0.0008 -0.0006 0.0004 5.5862 24.2287 30.8155 38.4456
frequency: 23.9829 30.5078 38.4315 52.0320 67.2957 86.9780 89.5030 97.2128 105.4067 124.2654 149.4725 172.2650 216.9563 230.2473 240.8342 251.3031 260.4240 265.7277 273.6275 286.6791 304.3492 308.8919 354.9026 389.7440 434.3969 491.9406 533.1106 577.1493 591.1060 607.8402 627.9386 677.3831 723.6248 765.0941 770.4203 813.2764 819.2134 831.3187 845.3103 869.8969 871.8841 903.7732 943.9966 986.5949 997.3542 1020.4089 1025.6118 1058.6352 1094.7728 1098.4440 1110.1954 1112.2363 1115.9212 1124.1909 1130.7946 1135.4574 1159.1221 1192.7619 1221.4024 1251.3255 1261.5889 1266.2030 1270.7162 1305.9070 1330.6882 1346.8246 1356.3230 1362.4216 1376.4502 1391.5464 1397.3731 1408.6973 1437.3186 1455.7378 1458.8065 1459.7229 1460.4248 1469.5450 1474.9087 1478.4392 1481.1360 1487.1455 1489.6886 1490.9088 1578.3960 1601.4547 1644.5240 2954.5611 2970.1254 2974.0315 2981.3180 2991.7656 2994.9733 2995.7916 3013.0328 3026.9860 3052.2135 3061.3617 3078.0737 3088.6740 3093.0293 3101.0571 3104.8871 3122.8802 3146.8100 3151.9421 3458.6884 3584.7795
redmass: 3.0406 2.0573 3.5645 3.9652 2.9529 1.8231 2.5273 2.4645 2.4162 2.8805 1.9147 1.7427 3.0529 1.2369 1.2989 4.3004 2.3925 2.8457 1.7073 2.5587 3.6378 3.3876 3.7166 4.0220 5.1256 5.4758 3.3197 2.9340 2.3923 4.2179 4.1352 3.9256 4.2403 1.4974 2.1056 1.0899 1.2565 3.6541 1.4211 1.5907 3.4680 4.9919 1.3067 5.3023 3.5316 3.1890 2.6744 3.8479 3.5269 1.3850 1.3398 1.9680 2.1759 2.9411 1.4601 1.4365 1.4592 1.9747 1.6054 1.1629 1.1433 1.3656 1.3262 4.6620 1.1637 1.2181 1.4464 1.9544 2.2750 1.2891 1.2946 2.0677 1.4677 1.1025 1.0420 1.0981 1.0404 2.3633 1.0952 1.1393 1.1059 1.0746 1.0825 1.1140 7.4933 6.6954 1.0908 1.0554 1.0347 1.0593 1.0586 1.0370 1.0609 1.0362 1.1073 1.1012 1.1037 1.1063 1.0973 1.0985 1.0989 1.1019 1.1013 1.1046 1.0902 1.0920 1.0445 1.0977
irintensity: 1.3275 0.0496 0.9540 2.5509 5.7524 0.8021 7.6683 1.9502 1.5905 0.1758 0.5026 3.4499 3.7097 0.3478 0.7499 1.9134 18.5744 2.7855 22.2968 21.0154 0.6227 10.9391 3.2379 7.0435 2.3901 2.5983 30.0066 96.4724 230.9851 27.8860 27.8719 10.3607 0.2233 3.5548 4.5246 3.1126 13.7467 1.4491 4.5487 2.4003 45.8625 24.1244 3.8491 45.6431 36.2939 30.0532 74.1134 269.1148 40.6090 42.1324 13.0675 5.1021 18.5222 33.3731 8.9850 3.9116 20.3943 83.9216 61.3775 5.6260 0.0096 4.5376 24.2913 97.2960 0.3925 9.2687 10.2122 13.3786 3.9276 34.4224 42.1897 58.1745 26.1158 21.1784 9.8487 0.9650 13.0683 68.5863 8.9277 17.4049 13.9458 19.2051 7.1050 1.6914 119.2145 49.2436 35.4631 40.7462 95.5169 39.2514 36.4929 29.0203 50.7106 23.4951 34.5912 5.6789 9.2303 45.1905 31.0530 34.9729 32.1783 38.5410 34.1746 17.8197 13.5655 3.5773 1.8657 0.4122
temp: 298.150 k
press: 1.00000 atm
elementType: 8 8 8 7 6 6 6 6 6 6 6 6 6 6 6 6 6 1 1 1 1 1 1 1 1 1 1 1 1 1 1 1 1 1 1 1 1 1
symmnumber: 1
zpe: 840046.6 jmol-1
zpe.correction: 0.319957 hartree
zpe.thermalcorrener: 0.340197 hartree
zpe.thermalcorrenthalpy: 0.341141 hartree
zpe.thermalcorrgfe: 0.269288 hartree
zpe.sumelectzpe: -787.017937 hartree
zpe.sumelectthermal: -786.997697 hartree
zpe.sumelectthermalent: -786.996753 hartree
zpe.sumelectthermalfe: -787.068605 hartree
dipole: 0.0946 2.6241 -1.2718
dipole: 2.9176
quadrupole: -95.6613 -91.2586 -106.4937
quadrupole: 0.6548 -11.5542 1.6447
quadrupole: 2.1432 6.5460 -8.6892 0.6548 -11.5542 1.6447
hfenergy: -787.3378936 hartree
pointgroup: C01 [X(C13H21N1O3)]
dipole: 0.0466625 -1.0495897 -0.4623627 debye
polarizability: 214.7262423|4.4826772|186.043108|4.971685|-3.9175896|108.2603298 unknown
InChI: InChI=1S/C13H21NO3/c1-4-16-12-9-10(6-7-14)8-11(15-3)13(12)17-5-2/h8-9H,4-7,14H2,1-3H3
charge 0 multiplicity 1
38 atoms
O  1.384178 -1.719447 -0.127415
O  2.257576 0.916913 -0.014109
O  0.327101 3.040391 -0.080891
N  -5.480321 -0.635195 1.065896
C  -1.919699 0.094085 -0.345136
C  -3.411412 -0.190592 -0.394029
C  -0.989517 -0.976063 -0.28878
C  0.396647 -0.718601 -0.178897
C  0.881366 0.62244 -0.106577
C  -1.439571 1.421226 -0.303208
C  -0.054976 1.688293 -0.186962
C  -4.033942 -0.365392 1.035107
C  0.947868 -3.122217 -0.269297
C  2.92662 0.489928 1.249688
C  2.208454 -3.982439 -0.233627
C  4.379191 0.947868 1.152101
C  1.317973 3.529358 -1.064685
H  -3.945371 0.635015 -0.903741
H  -3.614069 -1.11443 -0.972244
H  -1.361171 -2.004255 -0.342439
H  -2.123782 2.274399 -0.356202
H  -3.835548 0.549027 1.624729
H  -3.510949 -1.190642 1.554707
H  0.258869 -3.382864 0.560608
H  0.40573 -3.241416 -1.229693
H  2.402116 0.968026 2.100947
H  2.848857 -0.608622 1.338993
H  -5.757785 -1.523487 0.637227
H  -6.064808 0.14241 0.744646
H  2.741711 -3.856308 0.724288
H  1.942825 -5.049205 -0.34791
H  2.892978 -3.701341 -1.051796
H  4.93261 0.653686 2.062891
H  4.871163 0.484703 0.279436
H  4.439669 2.045098 1.045963
H  0.89307 3.480837 -2.086484
H  2.24826 2.9404 -1.011077
H  1.50289 4.578811 -0.787623
