program: Gaussian 09
title: 000045378
version: EM64L-G09RevD.01
frameworkgroup: C1[X(C20H27NO)]
method: RPBEPBE
basis: SDD
operation: Freq
keyword: #p
keyword: freq=noraman
keyword: PBEPBE/SDD
title: #p freq=noraman PBEPBE/SDD
converged: YES YES NO NO
title: Mulliken charges:
elementType: O N C C C C C C C C C C C C C C C C C C C C H H H H H H H H H H H H H H H H H H H H H H H H H H H
charge: -0.297917 -0.087506 -0.291602 0.234424 0.303301 0.344181 0.366557 -0.250627 -0.621188 -0.623441 0.478818 -0.370388 -0.866416 -0.854613 -0.398096 -0.423327 -0.815900 -0.231579 -0.221339 -0.250459 -0.615654 -0.610821 0.232625 0.181106 0.225769 0.234491 0.235436 0.223112 0.188404 0.235690 0.235677 0.231409 0.216091 0.252110 0.264684 0.249845 0.274391 0.224697 0.234778 0.222788 0.223156 0.222176 0.224961 0.225658 0.187078 0.221700 0.220652 0.187095 0.228011
chargesum: 0.00000
title: Mulliken charges with hydrogens summed into heavy atoms:
elementType: O N C C C C C C C C C C C C C C C C C C C C
charge: -0.297917 -0.087506 -0.058977 0.234424 0.303301 0.344181 0.366557 0.156248 -0.386697 -0.388005 0.478818 0.041128 -0.163639 -0.121728 -0.148250 -0.148935 -0.133637 -0.008423 0.000837 -0.025498 0.018782 0.024936
polarizability: 2.22698357e+02 2.90772945e-01 2.63073651e+02 -1.70966214e+00 1.18221686e+01 1.89073987e+02
1716.lowfreq: -24.5661 -5.9913 -5.5738 -0.0009 -0.0007 -0.0001 3.5531 8.7827 24.0167
frequency: -24.4729 8.0074 23.9576 33.7662 41.5367 47.0096 55.9408 88.2379 90.8303 112.3606 150.7099 154.4599 177.7889 193.6383 203.4940 208.8758 215.0725 224.7732 229.7213 237.4504 265.9811 276.7494 305.1800 326.4681 345.9309 366.6477 403.9282 424.8835 443.3224 464.6451 490.5071 507.2553 524.3634 526.7380 547.1737 567.6288 598.5986 616.2626 642.7251 702.9560 729.2897 755.3148 798.5028 814.3162 821.2840 858.0448 862.3426 871.1583 895.3673 923.5542 926.9843 949.9538 959.1571 985.8062 989.5868 998.8100 1014.8984 1019.7848 1020.3679 1028.3441 1030.6199 1033.9052 1040.1601 1043.7298 1047.1530 1052.9946 1071.3129 1082.0402 1087.2337 1095.8411 1138.0870 1140.8991 1169.9772 1173.9798 1184.0296 1196.8375 1215.9973 1231.3786 1250.1716 1265.5966 1282.1980 1285.6845 1297.4950 1312.2799 1321.4244 1337.0858 1371.5206 1380.7785 1389.5036 1396.1397 1398.2755 1399.5411 1414.8860 1418.5104 1434.1841 1442.7483 1444.7885 1461.3347 1463.9415 1464.5352 1472.5579 1474.3554 1475.2612 1476.2094 1478.3030 1480.9168 1484.4766 1486.9785 1493.3679 1497.7681 1585.7136 1590.8374 1613.0710 1618.3601 2843.2619 2850.3427 2868.1637 2930.4207 2945.5514 2970.8058 2973.5271 2983.0567 3013.1711 3018.9997 3028.5046 3042.5216 3045.9339 3054.4972 3064.9973 3078.2330 3078.4036 3083.1498 3085.2020 3096.0991 3110.1091 3114.4399 3118.4806 3126.6296 3139.5972 3156.7245 3172.2686
redmass: 1.0139 2.6049 3.7935 3.7545 3.9040 3.8401 4.1440 2.9288 1.9797 3.3040 1.5921 1.7544 1.6129 1.7157 2.6739 2.4986 1.6925 2.5607 2.9354 1.2180 3.6741 2.6336 3.2425 2.8035 2.4663 4.1618 2.8721 2.4575 3.4385 3.4823 2.8949 4.2294 3.8612 3.6767 4.1474 4.1843 3.5934 6.4194 4.8941 2.5481 1.6182 3.7229 2.5423 1.7573 2.0970 1.9431 1.2462 1.8578 1.3110 2.3715 3.1235 2.0380 3.5576 1.3778 5.9474 1.3176 1.6513 2.7755 2.2828 2.1599 2.3960 1.5284 1.6053 1.7541 1.5488 1.6285 1.5955 1.6057 1.5662 1.8950 2.2816 1.9067 1.0561 1.4410 1.1566 1.8216 1.7281 1.6705 1.6032 2.4809 1.2947 1.3933 1.5400 3.6040 1.4418 1.4462 3.5285 5.6481 1.4867 1.2311 1.2901 1.2413 2.4241 1.1510 2.2147 1.1742 1.9706 1.0505 1.0738 1.0877 1.0585 1.1008 1.0715 1.0724 1.0887 2.0437 1.0652 1.1490 1.0931 1.3044 6.6926 6.3287 6.0691 5.8856 1.0575 1.0632 1.0644 1.0622 1.0808 1.0381 1.0385 1.0379 1.0948 1.0721 1.0718 1.0922 1.0975 1.0950 1.0959 1.0977 1.1010 1.0998 1.1006 1.0991 1.0908 1.0916 1.0848 1.0881 1.0938 1.0982 1.0962
irintensity: 0.3960 0.3677 0.2476 0.1345 0.1328 0.1174 0.0725 0.4895 1.6187 0.8668 1.8099 0.4268 3.5558 2.0446 0.6189 0.7134 3.3963 1.7280 2.1140 1.0067 1.2727 1.9381 3.4332 1.9926 7.2623 3.5156 0.1489 0.2902 2.8471 3.9457 3.1253 0.6221 1.3442 3.2625 4.6461 0.5468 8.3192 0.1387 5.1794 15.9093 91.9445 4.7948 8.2525 14.5764 11.2474 9.5631 0.3636 15.2917 0.1781 8.4908 9.2392 1.2202 2.0585 0.3233 0.6232 0.7940 6.6010 59.3800 49.0833 8.0634 103.3237 12.6079 8.8248 22.1505 7.3045 42.4383 7.7356 5.5667 11.2473 3.8928 5.4319 3.5999 0.4665 3.4034 6.1664 2.4991 1.1520 6.7567 2.7631 14.3815 16.6987 9.1431 2.8803 0.9682 1.8268 4.4224 3.7922 1.5206 3.4800 11.8238 24.9335 2.1781 1.7177 1.4488 10.0795 2.8072 8.3429 16.0424 4.6337 2.9393 10.2916 4.5725 13.7592 19.8622 7.5189 30.0675 16.5070 21.2153 13.3516 27.7972 13.2034 0.9566 8.7488 37.4585 71.0203 87.7565 200.2248 44.8501 26.4157 41.6741 37.7548 24.3890 27.2963 43.9840 40.8749 34.7174 19.2825 22.9916 23.1105 27.8499 28.5230 17.3758 53.7886 4.5033 31.5848 20.3483 2.6272 4.0744 34.3061 33.2737 11.5373
temp: 298.150 k
press: 1.00000 atm
elementType: 8 7 6 6 6 6 6 6 6 6 6 6 6 6 6 6 6 6 6 6 6 6 1 1 1 1 1 1 1 1 1 1 1 1 1 1 1 1 1 1 1 1 1 1 1 1 1 1 1
symmnumber: 1
zpe: 1097923.7 jmol-1
zpe.correction: 0.418177 hartree
zpe.thermalcorrener: 0.441183 hartree
zpe.thermalcorrenthalpy: 0.442127 hartree
zpe.thermalcorrgfe: 0.363067 hartree
zpe.sumelectzpe: -906.622347 hartree
zpe.sumelectthermal: -906.599341 hartree
zpe.sumelectthermalent: -906.598397 hartree
zpe.sumelectthermalfe: -906.677457 hartree
dipole: -0.8205 0.6765 0.9382
dipole: 1.4182
quadrupole: -123.7188 -127.2122 -128.8220
quadrupole: 4.3277 -1.1849 2.6203
quadrupole: 2.8655 -0.6279 -2.2377 4.3277 -1.1849 2.6203
hfenergy: -907.0405238 hartree
pointgroup: C01 [X(C20H27N1O1)]
dipole: 0.3927994 -0.1552469 0.3645759 debye
polarizability: 226.4579542|-11.7178442|259.4973291|4.8427335|-10.332698|188.8907117 unknown
InChI: InChI=1S/C20H27NO/c1-15-13-16(2)19(17(3)14-15)20(22-12-11-21(4)5)18-9-7-6-8-10-18/h6-10,13-14,20H,11-12H2,1-5H3
charge 0 multiplicity 1
49 atoms
O  0.682674 1.290538 -0.095232
N  4.411114 1.547411 -0.212875
C  -0.36992 0.503501 0.593207
C  -0.325811 -0.985143 0.224979
C  -0.120764 -1.96483 1.2442
C  -0.473388 -1.403969 -1.135094
C  -1.713307 1.189713 0.319108
C  2.044436 0.907895 0.303562
C  -0.061804 -3.335759 0.891757
C  -0.396858 -2.783084 -1.44294
C  -0.188954 -3.767918 -0.448466
C  2.986166 1.926063 -0.356924
C  0.028974 -1.593905 2.716091
C  -0.726304 -0.416508 -2.263265
C  -2.923811 0.500574 0.584259
C  -1.771138 2.532331 -0.127724
C  -0.081407 -5.238889 -0.811416
C  -4.169864 1.141407 0.4055
C  -3.018286 3.171175 -0.31298
C  -4.222902 2.481034 -0.044937
C  4.913345 1.677378 1.170587
C  5.274802 2.259914 -1.176474
H  -0.173209 0.598475 1.682902
H  2.121322 0.929167 1.413499
H  2.291011 -0.11302 -0.048985
H  0.090448 -4.081137 1.682919
H  -0.506539 -3.09534 -2.489616
H  2.741359 1.948783 -1.434801
H  2.77157 2.946331 0.052047
H  -0.839481 -1.025268 3.098647
H  0.122579 -2.504302 3.332342
H  0.929941 -0.977934 2.900836
H  -0.590963 -0.902153 -3.24521
H  -1.759026 -0.022142 -2.219371
H  -0.053018 0.453566 -2.19303
H  -2.890182 -0.544263 0.915145
H  -0.83528 3.057571 -0.337401
H  -0.675693 -5.478478 -1.710873
H  0.968096 -5.519587 -1.02756
H  -0.430399 -5.886069 0.012686
H  -5.097146 0.594701 0.612325
H  -3.049135 4.208573 -0.666101
H  -5.189265 2.977992 -0.187586
H  4.334714 1.032854 1.854201
H  4.864815 2.727606 1.559252
H  5.966509 1.346742 1.21113
H  6.309907 1.881715 -1.095531
H  5.301088 3.368862 -1.019073
H  4.921286 2.069131 -2.205218
