program: Gaussian 09
title: 000005299
version: EM64L-G09RevD.01
frameworkgroup: C1[X(C8H15N3O7)]
method: RPBEPBE
basis: SDD
operation: Freq
keyword: #p
keyword: freq=noraman
keyword: PBEPBE/SDD
title: #p freq=noraman PBEPBE/SDD
converged: YES YES NO NO
title: Mulliken charges:
elementType: O O O O O O O N N N C C C C C C C C H H H H H H H H H H H H H H H
charge: -0.467339 -0.494325 -0.497218 -0.501792 -0.183494 -0.306374 -0.231957 -0.411441 -0.165328 0.054317 -0.082534 -0.122200 -0.100987 -0.083447 -0.405805 -0.069182 0.338013 -0.625924 0.269877 0.226195 0.254219 0.222004 0.281004 0.221152 0.386950 0.192498 0.379622 0.382390 0.385341 0.367441 0.258460 0.258845 0.271019
chargesum: 0.00000
title: Mulliken charges with hydrogens summed into heavy atoms:
elementType: O O O O O O O N N N C C C C C C C C
charge: -0.087717 -0.111935 -0.111877 -0.134351 -0.183494 -0.306374 -0.231957 -0.024491 -0.165328 0.054317 0.187343 0.103995 0.153232 0.138557 0.096351 0.123316 0.338013 0.162399
polarizability: 1.76197505e+02 6.95673398e+00 1.40340438e+02 4.65037319e+00 -1.45597228e+00 9.12603698e+01
1716.lowfreq: -5.3937 -0.0010 -0.0009 -0.0006 1.0797 9.6395 31.8464 34.7707 57.3782
frequency: 31.7764 34.7326 57.3745 62.9686 79.9203 105.6288 108.3173 111.8779 126.3474 137.1163 140.5615 176.4098 185.9328 220.5156 222.9196 238.2590 262.2410 270.9729 299.5691 307.3362 318.0223 342.6103 386.0810 395.5010 436.2631 477.5796 507.3939 518.0190 527.2220 546.1974 581.1945 617.2557 673.6836 695.6668 713.0276 736.9341 767.4686 827.2822 830.5889 840.7215 904.1225 913.0105 932.7503 966.1362 989.1393 1020.8709 1036.0678 1057.5941 1074.4315 1076.8268 1094.0667 1117.0503 1158.3294 1176.0110 1183.7040 1197.4335 1204.4086 1241.1397 1248.2782 1261.8603 1293.3467 1305.0950 1317.2251 1329.0670 1330.1918 1367.0972 1368.8794 1370.9735 1375.4728 1396.3885 1412.7552 1414.1669 1462.3871 1470.4575 1485.2026 1493.6096 1630.8524 1649.8953 2953.0987 2958.9289 2969.6026 2975.5114 2984.0643 3006.8959 3007.3715 3058.9482 3091.7752 3149.4541 3446.3353 3468.1597 3477.6312 3502.3632 3617.3552
redmass: 6.0883 8.8756 5.8861 4.7627 6.0778 7.0629 4.9745 5.9842 4.4601 1.4595 2.4864 4.5941 5.8107 3.4127 1.2326 6.0231 4.4279 5.2083 3.9496 4.1472 5.1727 5.5495 6.1813 4.8922 4.9536 7.4887 1.4442 1.9345 3.1823 1.3255 1.2781 2.7815 4.7856 3.7469 5.8102 1.2356 4.9902 2.8356 3.4826 3.1565 2.7423 2.8782 3.3905 7.3955 3.0478 2.2693 3.8375 3.0685 2.1229 2.2693 3.6101 1.3250 1.5232 1.9015 1.3294 1.3022 1.7197 1.2041 1.1015 1.7285 1.5095 1.3550 1.3920 1.2312 1.2942 1.4351 3.1073 1.8795 1.4065 1.5826 1.2256 1.5227 1.0431 1.1417 1.0770 2.0721 11.0020 8.4367 1.0840 1.0834 1.0846 1.0635 1.0800 1.0339 1.0846 1.1074 1.1010 1.1009 1.0773 1.0643 1.0647 1.0647 1.0672
irintensity: 0.1569 0.4674 2.2153 0.5915 3.8388 3.9439 8.3405 0.4556 4.8517 1.4478 3.8121 4.0971 15.4784 3.1364 167.8445 24.9254 22.7008 9.0121 13.4939 6.2566 4.2838 46.3729 3.5795 7.6230 6.9410 5.4595 171.2570 43.1564 6.6271 75.0770 169.6822 42.3381 18.4922 35.6263 7.3726 121.5348 42.0818 13.3339 43.1001 57.1067 23.0881 20.7105 263.1116 98.0340 38.1636 56.2619 30.4035 56.9212 7.4010 9.6875 63.7545 0.4915 18.6126 61.3506 10.0708 10.3732 38.8940 21.7955 17.6909 41.0912 13.3231 11.0358 65.1167 3.6643 2.0117 28.7813 246.4505 3.5752 39.9261 10.6778 45.7204 7.0830 20.0654 44.1353 4.3409 511.9839 324.9087 25.8854 14.3135 23.1431 77.2707 8.3468 76.2047 16.9004 45.2189 11.2864 12.2028 0.1694 89.3706 100.0625 31.3036 46.6450 15.8020
temp: 298.150 k
press: 1.00000 atm
elementType: 8 8 8 8 8 8 8 7 7 7 6 6 6 6 6 6 6 6 1 1 1 1 1 1 1 1 1 1 1 1 1 1 1
symmnumber: 1
zpe: 657427.4 jmol-1
zpe.correction: 0.250401 hartree
zpe.thermalcorrener: 0.270549 hartree
zpe.thermalcorrenthalpy: 0.271493 hartree
zpe.thermalcorrgfe: 0.200922 hartree
zpe.sumelectzpe: -1003.154502 hartree
zpe.sumelectthermal: -1003.134355 hartree
zpe.sumelectthermalent: -1003.133410 hartree
zpe.sumelectthermalfe: -1003.203981 hartree
dipole: -3.1689 -4.9517 -0.1880
dipole: 5.8819
quadrupole: -121.1411 -104.3289 -105.4829
quadrupole: -8.4567 -2.6010 -4.2922
quadrupole: -10.8235 5.9887 4.8347 -8.4567 -2.6010 -4.2922
hfenergy: -1003.4049032 hartree
pointgroup: C01 [X(C8H15N3O7)]
dipole: -1.221215 -1.9638033 0.0852831 debye
polarizability: 176.2141695|7.4995546|140.1655079|1.3692679|-4.6006449|91.4186354 unknown
InChI: InChI=1S/C8H15N3O7/c1-11(10-18)8(17)9-4(2-12)6(15)7(16)5(14)3-13/h2,4-7,9,13-16H,3H2,1H3
charge 0 multiplicity 1
33 atoms
O  -0.785261 2.107691 1.341672
O  -3.177368 0.939625 1.496311
O  -4.405918 -0.528515 -0.352131
O  -3.334541 -2.915814 -0.192853
O  1.010708 3.080503 -1.343765
O  0.853618 -1.690286 -0.215443
O  5.146344 -0.114766 0.240661
N  1.330172 0.591055 -0.370735
N  3.077168 -0.95936 0.043343
N  3.918194 0.162196 0.032947
C  -0.988986 0.872757 0.575408
C  -2.484301 0.748691 0.21392
C  -0.048472 0.980557 -0.655381
C  -2.931741 -0.591586 -0.409105
C  -2.453295 -1.848656 0.336014
C  -0.042232 2.433124 -1.158796
C  1.668348 -0.717454 -0.189828
C  3.592497 -2.319243 0.272084
H  -0.69375 -0.004233 1.183622
H  -2.7835 1.561543 -0.483195
H  -0.453174 0.332959 -1.46286
H  -2.609663 -0.654215 -1.46883
H  -1.390627 -2.055482 0.112666
H  -2.604515 -1.730656 1.428137
H  2.051368 1.325363 -0.379023
H  -1.045274 2.866762 -1.367399
H  -1.53196 2.16183 1.99792
H  -4.117404 0.646651 1.337511
H  -4.720741 -1.470364 -0.439011
H  -3.070234 -3.794314 0.170866
H  4.079892 -2.375457 1.260614
H  4.344087 -2.570659 -0.495828
H  2.739161 -3.009248 0.219087
