program: Gaussian 09
title: 000005273
version: EM64L-G09RevD.01
frameworkgroup: C1[X(C9H12N5O)]
method: RPBEPBE
basis: SDD
operation: Freq
keyword: #p
keyword: freq=noraman
keyword: PBEPBE/SDD
title: #p freq=noraman PBEPBE/SDD
converged: YES YES NO NO
title: Mulliken charges:
elementType: O N N N N N C C C C C C C C C H H H H H H H H H H H H
charge: -0.279014 -0.163080 -0.365555 -0.014299 -0.032411 -0.600900 -0.012318 -0.465193 -0.450504 -0.306736 0.156029 -0.041381 0.106807 0.221136 -0.318497 0.305526 0.289274 0.261734 0.275487 0.230646 0.252618 0.247819 0.341071 0.366280 0.280868 0.380086 0.334505
chargesum: 1.00000
title: Mulliken charges with hydrogens summed into heavy atoms:
elementType: O N N N N N C C C C C C C C C
charge: -0.279014 -0.163080 0.000725 -0.014299 -0.032411 0.113691 0.293208 0.085814 0.055629 0.193701 0.156029 0.299691 0.106807 0.221136 -0.037629
polarizability: 1.78821317e+02 3.73602996e-01 1.34297315e+02 -7.59527760e+00 -6.02092178e+00 7.33692791e+01
1716.lowfreq: -10.9190 -2.3527 0.0006 0.0006 0.0008 13.2488 39.6366 58.6133 92.3404
frequency: 37.9986 58.5367 92.2746 126.0878 158.3052 197.3733 238.2604 267.2773 289.7062 299.8671 384.3412 414.3194 498.4528 536.9254 549.5507 577.2388 595.2822 607.2774 630.4437 653.4460 658.9042 682.7918 705.2291 740.5126 786.4717 817.9901 846.5269 873.6318 879.4115 883.7723 922.1304 939.7770 948.4301 951.5807 1002.4969 1029.4324 1054.4636 1076.9724 1105.2953 1152.7493 1163.9846 1177.8192 1195.7729 1214.3573 1232.1328 1256.4671 1299.7541 1310.0867 1317.5137 1322.5559 1327.0556 1343.2757 1346.1488 1366.4034 1417.0368 1447.1309 1468.3872 1472.8122 1490.6591 1519.9592 1551.2092 1599.7096 1649.5262 3024.4046 3036.2371 3038.3254 3065.6221 3100.5374 3116.1731 3122.8519 3192.5447 3271.6278 3520.5658 3579.6842 3673.4910
redmass: 3.4762 4.1319 3.6977 4.2121 5.0961 2.7238 3.3826 5.1775 4.6438 4.3327 3.2661 1.1409 7.0016 3.4976 3.3478 2.7883 2.7258 3.5134 2.1458 1.3584 3.2791 2.6505 6.3852 5.2296 10.5515 3.5815 5.9705 1.4158 1.8731 1.9133 2.4702 2.5014 1.4498 2.4051 4.2248 3.3023 1.9798 1.9111 1.7390 1.2305 1.4819 2.2869 2.4898 1.5318 2.1840 1.3929 2.7117 1.4642 2.0551 1.5604 3.2068 1.3766 1.8476 2.9313 1.9744 2.8405 1.0838 1.0913 1.0965 4.0421 10.0702 2.0641 2.1305 1.0654 1.0610 1.0649 1.0883 1.1008 1.1054 1.1057 1.0942 1.1021 1.0481 1.0833 1.1030
irintensity: 2.4287 6.1322 0.9370 5.3256 3.6919 2.6126 0.3091 0.2044 5.7402 4.8117 3.5710 71.6973 5.5860 10.8310 2.6230 1.5413 12.3634 11.4726 137.0291 37.6394 87.1066 143.0196 5.7579 18.3101 15.4502 21.4290 10.0661 8.9100 17.3417 4.1865 12.7228 36.9680 12.9161 2.4568 1.0839 154.3786 19.8448 21.5029 12.4103 27.4930 14.4718 36.2680 2.9783 5.6298 49.6926 3.8291 113.1132 37.7127 3.1277 10.6782 30.8186 2.4918 18.2218 13.1771 20.9120 121.3641 22.3859 18.6874 5.2103 14.0023 94.4984 53.4896 544.3426 14.0169 39.8757 5.1269 7.4504 6.3403 6.6107 19.0489 1.0113 54.5434 203.8006 139.3389 56.3153
temp: 298.150 k
press: 1.00000 atm
elementType: 8 7 7 7 7 7 6 6 6 6 6 6 6 6 6 1 1 1 1 1 1 1 1 1 1 1 1
symmnumber: 1
zpe: 571236.9 jmol-1
zpe.correction: 0.217573 hartree
zpe.thermalcorrener: 0.229967 hartree
zpe.thermalcorrenthalpy: 0.230911 hartree
zpe.thermalcorrgfe: 0.178219 hartree
zpe.sumelectzpe: -697.814797 hartree
zpe.sumelectthermal: -697.802402 hartree
zpe.sumelectthermalent: -697.801458 hartree
zpe.sumelectthermalfe: -697.854150 hartree
dipole: -1.6536 -5.7507 1.7643
dipole: 6.2384
quadrupole: -41.0513 -62.7706 -85.3512
quadrupole: 16.2042 1.3057 -3.3589
quadrupole: 22.0064 0.2871 -22.2935 16.2042 1.3057 -3.3589
hfenergy: -698.0323694 hartree
pointgroup: C01 [X(C9H12N5O1)]
dipole: -0.5461686 2.3917258 -0.0734443 debye
polarizability: 178.0091874|-4.666257|133.2824352|10.6049887|10.2372447|75.1962886 unknown
InChI: InChI=1S/C9H12N5O/c10-8-7-9(12-4-11-8)14(5-13-7)6-2-1-3-15-6/h4-6,13H,1-3,10H2
charge 1 multiplicity 1
27 atoms
O  3.008941 0.492547 0.975153
N  0.708495 0.270975 0.420555
N  -0.747375 1.949998 0.406811
N  -0.815697 -1.581043 -0.190866
N  -3.123865 -0.842824 -0.537346
N  -3.873807 1.360163 -0.33492
C  2.009274 -0.497574 0.663588
C  2.480296 -1.267838 -0.587005
C  3.39562 -0.240809 -1.303305
C  4.051311 0.499752 -0.124435
C  -0.548764 -0.281233 0.074589
C  0.555918 1.603388 0.622306
C  -1.479944 0.793409 0.060738
C  -2.838956 0.474341 -0.267896
C  -2.138891 -1.781043 -0.489016
H  1.811472 -1.135095 1.541633
H  1.646187 -1.645066 -1.196844
H  3.067802 -2.137038 -0.243013
H  4.141538 -0.734149 -1.946085
H  2.805925 0.449497 -1.932656
H  4.937337 -0.027709 0.268181
H  4.299895 1.554549 -0.317535
H  1.362316 2.263336 0.928974
H  -1.100208 2.903158 0.502245
H  -2.439198 -2.807752 -0.711952
H  -4.792213 0.98379 -0.578855
H  -3.787206 2.357869 -0.155346
