program: Gaussian 09
title: 000045366
version: EM64L-G09RevD.01
frameworkgroup: C1[X(C17H19Cl2NO)]
method: RPBEPBE
basis: SDD
operation: Freq
keyword: #p
keyword: freq=noraman
keyword: PBEPBE/SDD
title: #p freq=noraman PBEPBE/SDD
converged: YES YES NO NO
title: Mulliken charges:
elementType: Cl Cl O N C C C C C C C C C C C C C C C C C H H H H H H H H H H H H H H H H H H H
charge: -0.069436 -0.066391 -0.300957 -0.091961 -0.271748 0.400405 0.588522 -0.243537 -0.370697 -0.371561 -0.415798 -0.383238 -0.339440 -0.613796 -0.613105 -0.214572 -0.199895 -0.227248 -0.233118 -0.112330 -0.229338 0.236789 0.195989 0.220652 0.221495 0.192764 0.249953 0.284292 0.264878 0.223095 0.189691 0.224895 0.222144 0.188885 0.227943 0.254369 0.253087 0.257894 0.234002 0.236424
chargesum: 0.00000
title: Mulliken charges with hydrogens summed into heavy atoms:
elementType: Cl Cl O N C C C C C C C C C C C C C C C C C
charge: -0.069436 -0.066391 -0.300957 -0.091961 -0.034960 0.400405 0.588522 0.173104 0.043562 -0.121608 -0.131506 -0.383238 -0.074563 0.023885 0.025867 0.039797 0.053192 0.030645 0.000885 -0.112330 0.007086
polarizability: 2.34159732e+02 1.92709841e+01 2.20643546e+02 4.63448270e-01 -4.15334059e+00 1.74119921e+02
1716.lowfreq: -24.3999 -7.1782 -2.4897 -0.0007 0.0017 0.0021 6.1626 10.3454 24.8190
frequency: -23.3101 8.9873 24.6499 27.0944 40.5043 48.5522 81.5522 90.4363 120.9243 131.9388 149.8310 166.5234 198.3363 212.7213 221.8785 227.7318 257.6186 285.8676 295.0441 316.0384 349.3768 383.5725 389.0564 392.9309 409.2141 435.0425 448.8735 474.2599 486.3059 508.1317 565.5857 615.3146 625.2161 668.6070 673.6918 715.9102 733.8177 763.9695 792.5019 809.6442 821.4623 834.8748 845.6552 860.3692 882.0827 942.3465 956.4839 962.3387 982.7764 991.5146 999.5420 1009.9294 1027.3679 1033.8612 1036.3521 1040.8674 1066.6318 1072.1957 1088.6266 1094.5575 1108.6603 1119.9783 1139.0817 1167.3374 1171.2201 1179.1019 1186.0744 1208.0820 1240.1562 1252.7308 1266.2159 1283.4681 1288.8396 1295.2751 1308.5060 1339.6124 1372.0046 1379.2403 1389.6472 1394.4064 1418.9226 1425.7761 1442.7025 1457.1408 1460.2250 1467.0440 1473.4420 1475.6200 1476.9649 1485.3532 1489.5997 1574.6280 1586.7363 1599.8653 1604.2028 2849.5332 2857.8867 2877.0205 2949.3733 2950.6506 3018.9436 3020.0231 3029.3616 3047.8219 3079.0771 3086.3614 3135.5598 3139.7311 3147.4023 3160.6358 3162.0124 3171.3325 3176.2003 3183.4651
redmass: 2.5166 9.1234 4.2119 4.6771 6.2156 5.8161 3.7734 1.9493 5.0375 4.7027 4.0990 8.3837 4.6096 1.1577 3.0519 1.7015 3.3069 5.3672 5.2343 4.1083 2.7891 4.3745 5.4129 5.3987 2.9502 2.8658 3.2570 3.8984 3.3186 4.6679 4.5545 5.9989 7.1558 6.1722 4.9443 4.4439 4.1318 1.3039 2.1695 1.3289 2.8829 1.3762 2.4258 1.6961 2.0234 4.9873 1.4083 1.4604 1.3530 1.3404 4.4963 6.8836 3.5325 1.5957 2.2131 3.1097 1.6110 2.6488 1.4698 2.1095 1.3710 1.7394 1.4592 1.3872 1.1143 1.4736 1.5883 1.9259 1.7076 1.8267 2.4245 1.2577 1.3170 1.3382 1.3034 1.4422 5.4693 4.2865 3.4490 1.5104 1.1470 2.1179 1.1657 2.4307 1.0479 1.0628 1.0963 2.1838 1.0862 1.0579 1.0797 6.1825 7.8382 6.3099 6.8726 1.0570 1.0602 1.0668 1.0760 1.0652 1.0955 1.0740 1.0729 1.0943 1.1009 1.1005 1.0858 1.0893 1.0905 1.0894 1.0955 1.0956 1.0995 1.0958
irintensity: 0.5388 0.5474 0.0301 0.1080 0.4262 0.0580 0.4250 1.2582 1.2246 0.3409 1.7953 1.1947 1.5901 1.2278 4.0882 0.7489 4.7357 0.6239 1.4414 3.3212 5.2004 1.0128 10.2743 2.9423 0.1024 5.7842 18.3332 10.2168 20.2900 8.1651 2.7179 13.7721 0.9308 10.8109 10.9321 12.3496 0.5822 92.4448 46.7869 2.6085 21.0041 1.2593 9.9388 16.2645 8.1203 10.6467 5.2155 1.6776 0.5929 1.0299 72.9187 58.0913 20.7462 28.5213 29.8600 177.7285 10.9040 23.5528 8.9879 3.4088 6.7520 4.0891 2.4427 6.6286 1.0725 5.3002 6.7780 0.1512 5.8847 14.2654 15.3914 11.7735 9.4876 2.1068 7.0373 6.3679 2.0985 2.2329 7.9517 5.9575 1.6900 24.6421 3.0416 21.7336 13.7748 4.4200 52.1937 69.0825 11.0622 11.9122 9.8531 12.1896 3.8721 5.0690 3.6998 70.7598 123.0146 154.9875 16.1414 39.4297 14.4284 53.1679 41.1850 37.3639 33.1295 49.5402 0.8730 6.9319 6.7143 1.6044 12.0126 4.2178 13.6224 2.5434
temp: 298.150 k
press: 1.00000 atm
elementType: 17 17 8 7 6 6 6 6 6 6 6 6 6 6 6 6 6 6 6 6 6 1 1 1 1 1 1 1 1 1 1 1 1 1 1 1 1 1 1 1
symmnumber: 1
zpe: 833003.7 jmol-1
zpe.correction: 0.317274 hartree
zpe.thermalcorrener: 0.337793 hartree
zpe.thermalcorrenthalpy: 0.338738 hartree
zpe.thermalcorrgfe: 0.264080 hartree
zpe.sumelectzpe: -1707.720663 hartree
zpe.sumelectthermal: -1707.700144 hartree
zpe.sumelectthermalent: -1707.699200 hartree
zpe.sumelectthermalfe: -1707.773857 hartree
dipole: 3.3010 0.7882 1.1910
dipole: 3.5967
quadrupole: -148.3100 -125.8249 -135.1219
quadrupole: -10.2554 0.9491 4.3413
quadrupole: -11.8911 10.5940 1.2970 -10.2554 0.9491 4.3413
hfenergy: -1708.0379372 hartree
pointgroup: C01 [X(C17H19Cl2N1O1)]
dipole: 1.2887731 -0.3859321 -0.4387283 debye
polarizability: 233.3839172|-19.5442208|219.9735237|1.1515559|-9.0395897|175.5657578 unknown
InChI: InChI=1S/C17H19Cl2NO/c1-20(2)11-12-21-17(13-7-9-14(18)10-8-13)15-5-3-4-6-16(15)19/h3-10,17H,11-12H2,1-2H3
charge 0 multiplicity 1
40 atoms
Cl 0.349299 -2.414971 2.649869
Cl -5.928141 1.958881 -0.136676
O  0.775087 0.956783 -0.083889
N  4.413579 1.838811 -0.118646
C  -0.120603 -0.012206 0.565895
C  -1.557275 0.47503 0.353601
C  0.111002 -1.423046 0.012622
C  2.190563 0.781719 0.288667
C  2.961785 1.914923 -0.403476
C  -2.645599 -0.371067 0.68357
C  -1.819661 1.779804 -0.127258
C  0.342656 -2.560557 0.815307
C  0.112425 -1.615686 -1.394768
C  4.767012 2.315078 1.235049
C  5.231784 2.495685 -1.158392
C  -3.977889 0.073449 0.541801
C  -3.148405 2.23747 -0.282696
C  0.569519 -3.843142 0.276142
C  0.33648 -2.884696 -1.963572
C  -4.20697 1.375808 0.057547
C  0.56598 -4.002863 -1.126499
H  0.092668 -0.024703 1.65727
H  2.287702 0.828473 1.394316
H  2.571712 -0.198829 -0.058024
H  2.811215 1.808733 -1.49318
H  2.516186 2.896722 -0.104286
H  -2.460444 -1.387573 1.048064
H  -0.978105 2.428365 -0.382167
H  -0.057893 -0.738997 -2.029341
H  4.213767 1.747124 2.002259
H  4.549141 3.403496 1.386203
H  5.845233 2.153726 1.41225
H  6.303083 2.33042 -0.943675
H  5.063655 3.600797 -1.228571
H  5.010133 2.051625 -2.144868
H  -4.816929 -0.579592 0.798209
H  -3.352637 3.244448 -0.658297
H  0.745744 -4.69458 0.939561
H  0.332297 -3.005663 -3.051889
H  0.741743 -4.994401 -1.55693
