program: Gaussian 09
title: 000045257
version: EM64L-G09RevD.01
frameworkgroup: C1[X(C17H25NO3)]
method: RPBEPBE
basis: SDD
operation: Freq
keyword: #p
keyword: freq=noraman
keyword: PBEPBE/SDD
title: #p freq=noraman PBEPBE/SDD
converged: YES YES NO NO
title: Mulliken charges:
elementType: O O O N C C C C C C C C C C C C C C C C C H H H H H H H H H H H H H H H H H H H H H H H H H
charge: -0.286555 -0.271718 -0.259490 -0.120404 0.042480 -0.412208 -0.395000 -0.415441 -0.391731 -0.338903 -0.767108 -0.463946 -0.281646 0.188289 0.218283 -0.351940 -0.316632 -0.345651 -0.342215 0.333384 -0.537609 0.168113 0.185641 0.200206 0.171044 0.254147 0.188637 0.212108 0.206202 0.193985 0.216742 0.187030 0.215496 0.218037 0.225092 0.247668 0.218523 0.257345 0.213642 0.267432 0.272350 0.244313 0.253511 0.225037 0.225420 0.248040
chargesum: 0.00000
title: Mulliken charges with hydrogens summed into heavy atoms:
elementType: O O O N C C C C C C C C C C C C C C C C C
charge: -0.286555 -0.271718 -0.259490 -0.120404 0.210594 -0.026361 0.030191 -0.014696 0.008456 0.064869 -0.108485 0.002246 0.189342 0.188289 0.218283 -0.084508 -0.044282 -0.101338 -0.088704 0.333384 0.160888
polarizability: 3.09394558e+02 -7.79080249e+00 1.92333843e+02 -6.18917793e+00 6.97373370e+00 1.30695142e+02
1716.lowfreq: -1.7768 -0.0011 -0.0008 0.0005 2.8715 9.9284 15.7380 22.8924 29.1623
frequency: 15.6456 22.7280 28.5316 48.0813 63.2315 83.1252 92.5233 98.5231 135.9334 146.4842 178.9012 203.4672 215.0321 223.6606 246.9011 256.0366 281.2105 304.5520 315.1592 321.3285 332.0235 337.4713 380.9347 412.5154 417.4749 434.6033 443.7983 484.3824 501.1818 506.7994 544.3267 559.0303 606.8738 627.9556 677.7739 701.4444 727.7315 754.3839 785.2856 797.6107 819.1640 824.7771 825.3193 850.8972 868.5462 882.1415 895.9463 928.6658 933.2931 975.8080 979.4454 983.2860 985.8285 992.1559 999.8221 1000.6186 1049.8263 1057.8644 1081.3215 1083.2587 1098.6243 1110.8836 1111.7297 1121.1164 1130.6815 1139.2498 1155.6227 1160.1014 1171.2373 1186.2522 1218.3468 1233.0838 1234.4151 1242.1182 1255.4621 1264.5224 1275.4487 1285.6756 1298.5891 1302.3740 1319.1002 1330.2472 1341.3747 1349.2783 1353.7146 1365.9145 1373.4724 1380.2855 1382.8845 1385.9890 1426.9361 1435.7155 1449.1091 1455.6992 1459.9022 1464.9088 1468.0568 1470.3663 1471.9144 1476.6713 1483.8009 1487.5621 1488.9837 1497.3648 1572.9173 1608.2166 1621.0696 2798.0953 2821.9537 2835.7923 2966.3371 2966.5806 2974.9222 2981.5392 2987.5950 3008.7907 3030.0375 3038.5237 3040.2569 3044.7409 3050.6776 3054.1359 3057.3375 3070.4418 3077.9155 3082.1610 3120.9129 3130.2387 3149.3010 3160.9896 3169.9499 3183.6538
redmass: 4.6434 5.8077 3.2937 3.7910 4.4020 3.9601 6.3797 3.1787 4.5129 3.1641 2.9308 1.3021 2.4522 1.2451 2.5215 2.0299 3.1243 2.0150 3.6538 5.5207 2.1551 2.7064 3.5151 3.2836 2.9827 3.9455 3.0715 2.8237 4.2500 2.9576 1.7147 4.0495 4.5065 6.9569 4.2237 2.5171 4.1074 4.6230 2.9433 1.9405 1.6554 1.8027 1.2859 1.6647 2.1425 2.2538 1.4084 1.8668 4.6669 1.3566 2.0804 8.4182 1.3494 1.5550 2.9847 1.4966 2.0014 4.2845 3.0356 1.9347 2.6097 1.2620 1.3231 1.7810 2.0499 1.9660 1.3260 2.4178 1.2318 1.4406 1.6226 1.3622 3.1315 1.4651 3.5528 1.2792 1.2110 1.1344 1.2847 1.2820 1.2860 1.2659 1.4158 1.5253 1.5809 1.4244 1.3526 5.0904 1.2533 1.3402 4.1158 1.1966 1.0903 1.1000 1.0865 1.0747 1.0500 1.0911 1.0768 1.0690 1.0851 1.0822 1.0644 2.4615 7.8422 9.2159 6.5733 1.0801 1.0719 1.0706 1.0611 1.0332 1.0594 1.0380 1.0616 1.0622 1.0962 1.1019 1.0882 1.0586 1.0947 1.0968 1.1042 1.0968 1.0982 1.0991 1.1086 1.0999 1.0880 1.0886 1.0958 1.0970
irintensity: 0.2826 0.6377 0.7689 1.2966 0.7380 0.8959 0.5751 0.4306 6.6251 2.6218 2.4998 0.3743 0.7283 0.1553 5.1785 1.7047 8.7214 3.4900 4.1701 7.4187 3.1793 2.4392 0.9078 1.3490 0.0406 8.4598 1.6685 7.2179 2.4081 6.8606 0.9306 9.5466 17.6299 4.9865 25.4318 10.8118 7.6245 15.9717 4.7005 0.4592 0.9515 0.8313 6.2207 59.1039 6.7421 4.1561 6.1891 0.9550 31.0513 0.9362 3.2280 71.6632 0.0526 6.7548 52.5731 1.0346 13.7356 317.3521 14.9895 14.4138 12.3199 0.5006 13.5861 8.8821 41.0054 13.5954 7.9347 19.5061 215.5794 6.3829 43.1366 20.8679 71.9310 24.9355 424.9940 9.8399 15.5236 3.7934 2.9521 5.8160 28.9258 17.2558 0.6082 3.5218 8.5299 9.4582 9.6045 33.9095 10.9063 2.7425 0.7938 11.1256 7.0151 23.3595 6.4907 9.0862 14.1601 5.3622 56.9761 10.4954 3.9649 9.9492 23.6793 52.1672 6.7993 302.3168 145.9924 59.7502 42.1731 217.7884 44.0715 69.3583 26.4071 40.9590 29.5941 25.4140 63.7629 32.1837 26.0111 22.2070 32.7550 50.3594 44.5813 30.1173 50.2153 41.3309 18.5631 23.9379 1.9020 2.9617 12.7524 3.7816
temp: 298.150 k
press: 1.00000 atm
elementType: 8 8 8 7 6 6 6 6 6 6 6 6 6 6 6 6 6 6 6 6 6 1 1 1 1 1 1 1 1 1 1 1 1 1 1 1 1 1 1 1 1 1 1 1 1 1
symmnumber: 1
zpe: 1029102.6 jmol-1
zpe.correction: 0.391964 hartree
zpe.thermalcorrener: 0.413161 hartree
zpe.thermalcorrenthalpy: 0.414105 hartree
zpe.thermalcorrgfe: 0.339686 hartree
zpe.sumelectzpe: -941.597624 hartree
zpe.sumelectthermal: -941.576427 hartree
zpe.sumelectthermalent: -941.575483 hartree
zpe.sumelectthermalfe: -941.649902 hartree
dipole: -1.4103 0.1718 0.8858
dipole: 1.6743
quadrupole: -94.3968 -121.7311 -128.5897
quadrupole: -13.9872 -1.2708 0.8613
quadrupole: 20.5091 -6.8252 -13.6838 -13.9872 -1.2708 0.8613
hfenergy: -941.9895881 hartree
pointgroup: C01 [X(C17H25N1O3)]
dipole: 0.5548305 0.0531437 -0.3510369 debye
polarizability: 309.3249545|8.0749566|191.5762688|-6.3983435|-9.9997105|131.5223191 unknown
InChI: InChI=1S/C17H25NO3/c1-14-6-3-4-11-18(14)12-5-13-21-17(19)15-7-9-16(20-2)10-8-15/h7-10,14H,3-6,11-13H2,1-2H3
charge 0 multiplicity 1
46 atoms
O  0.449975 -1.138745 0.445068
O  0.378147 1.127039 -0.122399
O  6.748821 -0.204414 0.105469
N  -3.795689 -0.280377 -0.217425
C  -5.280438 -0.461305 -0.098613
C  -5.883764 0.683158 0.75505
C  -3.453714 1.048268 -0.804365
C  -5.539938 2.078784 0.197384
C  -4.012115 2.208317 0.039499
C  -3.142685 -1.389443 -0.966376
C  -5.656542 -1.8212 0.529433
C  -1.598472 -1.314311 -0.962348
C  -1.04328 -1.156246 0.460296
C  1.045827 0.087632 0.128873
C  2.529016 0.004379 0.130259
C  3.270475 1.171074 -0.1813
C  3.224167 -1.201196 0.428074
C  4.678378 1.15106 -0.201297
C  4.626043 -1.23439 0.412213
C  5.358638 -0.059112 0.09635
C  7.563859 0.972581 -0.215059
H  -5.74586 -0.403227 -1.121795
H  -6.981449 0.545012 0.80437
H  -5.488714 0.587512 1.786586
H  -3.850068 1.129769 -1.852278
H  -2.355712 1.142909 -0.856778
H  -6.025475 2.213221 -0.791817
H  -5.936663 2.869936 0.861915
H  -3.530038 2.188353 1.036074
H  -3.742508 3.168439 -0.440795
H  -3.440027 -2.341691 -0.493895
H  -3.493061 -1.430032 -2.031815
H  -6.730308 -1.820731 0.791186
H  -5.486908 -2.676221 -0.147692
H  -5.076457 -1.984285 1.456809
H  -1.23732 -0.478166 -1.58594
H  -1.205411 -2.24631 -1.411569
H  -1.414152 -0.229713 0.926777
H  -1.293145 -2.021013 1.096429
H  2.721886 2.091487 -0.4075
H  2.650633 -2.100011 0.669142
H  5.227752 2.064692 -0.445439
H  5.180189 -2.150227 0.637726
H  7.35381 1.33864 -1.238293
H  7.39647 1.787129 0.515382
H  8.604727 0.624173 -0.151176
