program: Gaussian 09
title: 000045256
version: EM64L-G09RevD.01
frameworkgroup: C1[X(C18H27NO2)]
method: RPBEPBE
basis: SDD
operation: Freq
keyword: #p
keyword: freq=noraman
keyword: PBEPBE/SDD
title: #p freq=noraman PBEPBE/SDD
converged: YES YES NO NO
title: Mulliken charges:
elementType: O O N C C C C C C C C C C C C C C C C C C H H H H H H H H H H H H H H H H H H H H H H H H H H H
charge: -0.291460 -0.259767 -0.106309 -0.029682 -0.445360 -0.068745 -0.427938 -0.406949 -0.390904 -0.342951 -0.722461 -0.737502 -0.411691 -0.271422 0.211714 0.210949 -0.343019 -0.340451 -0.220390 -0.218362 -0.222910 0.191980 0.212008 0.203384 0.202524 0.196437 0.214050 0.198351 0.209709 0.198745 0.198023 0.230263 0.170884 0.252194 0.203431 0.194259 0.207335 0.214919 0.218797 0.194454 0.229380 0.237087 0.221956 0.270059 0.269138 0.233162 0.230993 0.232087
chargesum: 0.00000
title: Mulliken charges with hydrogens summed into heavy atoms:
elementType: O O N C C C C C C C C C C C C C C C C C C
charge: -0.291460 -0.259767 -0.106309 0.162297 -0.029968 0.133779 -0.017451 0.001111 0.005864 0.058196 -0.072577 -0.096451 0.012143 0.187620 0.211714 0.210949 -0.072960 -0.071312 0.012772 0.012631 0.009177
polarizability: 2.41793412e+02 1.20598616e+01 2.24140055e+02 -1.39050793e+01 2.10302475e+00 1.47375578e+02
1716.lowfreq: -9.3168 -0.0004 0.0003 0.0007 4.1486 5.8634 14.2635 20.3698 35.9928
frequency: 5.0955 19.9887 31.0227 51.6199 52.8106 61.9878 101.5313 106.8654 116.7974 147.8826 171.8328 195.9309 208.7951 220.9714 233.3790 240.9534 244.4122 277.5853 315.5180 340.9070 347.1570 378.8861 403.8558 404.1523 411.6939 437.3227 442.0600 460.8780 484.2347 516.7247 534.6260 614.2407 626.5424 662.5932 680.1624 702.3893 750.5642 759.8327 794.9070 796.5870 814.8223 820.0372 841.8843 866.1533 866.6656 880.1776 882.2793 902.2378 919.7283 930.7795 955.1750 958.4585 990.0222 990.4477 997.0003 1008.6625 1016.4527 1021.3040 1023.9433 1045.2989 1058.9860 1069.4175 1077.1820 1087.3563 1089.7094 1093.9148 1111.2902 1139.8984 1164.3753 1173.7026 1174.3395 1180.3804 1182.0753 1192.0590 1205.1359 1241.5339 1247.2018 1252.5396 1268.5234 1281.0340 1305.5690 1310.7080 1314.5736 1317.6511 1321.0337 1330.9593 1334.8159 1343.4266 1346.3063 1357.1531 1360.5412 1369.1881 1384.8342 1389.6188 1392.9982 1437.6473 1452.4486 1459.8640 1463.1156 1468.8825 1471.4410 1472.0735 1473.7652 1478.5730 1480.7764 1486.5402 1487.3556 1498.1192 1584.2320 1611.3868 1619.4557 2849.6533 2958.1899 2965.7801 2968.8353 2969.3301 2971.7720 2972.9202 2978.0594 2983.9262 2992.9009 3004.5770 3024.7827 3032.6962 3033.2407 3040.7562 3047.2822 3054.3830 3060.7033 3063.2011 3072.5386 3073.3270 3089.0190 3129.0342 3141.9406 3154.3718 3166.4762 3177.6902
redmass: 4.4918 4.2870 3.9803 3.4692 3.2612 4.6544 4.1698 3.8967 3.2791 3.4562 2.5296 4.0596 1.2398 1.6206 2.0869 1.6567 2.7006 2.5717 2.4101 2.2825 5.1317 2.2481 2.4829 2.7550 2.8769 2.5447 3.5740 2.6413 4.2877 2.9807 2.4995 6.4391 2.4897 6.3126 5.0262 1.6017 1.5801 2.7307 2.1376 2.0322 3.3854 2.3059 2.2080 1.2663 2.7786 2.2909 2.1195 1.4831 1.2451 1.8815 1.4194 1.4009 2.6514 4.0235 1.3836 1.3274 2.5270 2.2327 2.1018 1.8643 2.5560 1.8249 1.8157 1.8966 2.2237 2.2483 2.1504 2.2567 1.7782 1.0607 1.3949 2.2628 1.1491 1.6228 1.2630 2.6455 1.6042 1.3036 1.3250 1.1706 1.1808 1.4347 1.3234 1.4278 1.4677 1.3498 1.2994 1.3540 1.4601 1.5114 1.4063 1.2137 1.3437 9.9274 1.2526 2.2436 1.0815 1.0750 1.0648 1.0688 1.0880 1.0707 1.0869 2.1753 1.0897 1.0722 1.0690 1.0553 6.9090 6.1797 9.9883 1.0705 1.0778 1.0372 1.0440 1.0539 1.0697 1.0651 1.0686 1.0780 1.0605 1.0603 1.0974 1.0893 1.0940 1.0982 1.1009 1.0985 1.1017 1.0978 1.1050 1.0989 1.0984 1.0855 1.0891 1.0939 1.0978 1.0979
irintensity: 0.5973 0.1761 0.2487 0.3679 0.0165 1.7099 0.3368 1.6320 0.6597 0.9445 0.2614 2.1887 0.1879 0.8135 2.0701 1.6914 4.0667 2.8619 3.4672 0.1447 0.3823 1.6356 2.5778 0.3129 5.4564 3.5034 0.9112 5.4763 2.0706 6.2674 3.1365 0.3845 4.1884 4.2126 14.3460 91.2115 6.7241 5.7180 14.6540 12.1358 5.3216 2.5114 16.8403 0.3078 13.7800 6.0451 7.4248 4.8061 6.5582 2.6083 4.2906 1.1290 32.6330 10.1235 0.2355 0.4357 13.7064 49.3786 15.5166 5.9364 243.5923 31.5490 40.8471 48.0137 4.7421 18.1100 1.0615 2.8482 23.4914 0.2239 7.3380 14.5479 31.6741 2.9598 6.2193 301.2541 72.4515 3.7718 3.0652 0.6732 8.8551 1.5164 1.5346 1.2606 3.7905 1.8926 7.7181 0.9984 0.2413 17.3637 5.0663 18.9261 10.4411 2.1538 13.8737 16.2048 3.1711 2.2871 11.0527 8.1421 16.0237 2.6371 22.2438 3.3920 19.2938 2.2267 12.0180 17.8081 45.4999 11.7808 168.2153 79.6526 4.6593 28.7354 65.0383 4.7000 23.6328 39.1448 2.1772 87.5603 17.8501 28.2332 57.7908 10.9724 78.7735 37.1452 70.0111 9.1972 34.3109 111.6178 28.6041 56.5986 22.3144 0.3492 11.3878 15.6728 22.2654 8.0386
temp: 298.150 k
press: 1.00000 atm
elementType: 8 8 7 6 6 6 6 6 6 6 6 6 6 6 6 6 6 6 6 6 6 1 1 1 1 1 1 1 1 1 1 1 1 1 1 1 1 1 1 1 1 1 1 1 1 1 1 1
symmnumber: 1
zpe: 1091472.3 jmol-1
zpe.correction: 0.415720 hartree
zpe.thermalcorrener: 0.437159 hartree
zpe.thermalcorrenthalpy: 0.438104 hartree
zpe.thermalcorrgfe: 0.361856 hartree
zpe.sumelectzpe: -905.684721 hartree
zpe.sumelectthermal: -905.663281 hartree
zpe.sumelectthermalent: -905.662337 hartree
zpe.sumelectthermalfe: -905.738585 hartree
dipole: -1.4358 1.4557 -0.3292
dipole: 2.0709
quadrupole: -120.4630 -125.6376 -130.6602
quadrupole: 15.1082 -1.0564 -2.4225
quadrupole: 5.1240 -0.0507 -5.0733 15.1082 -1.0564 -2.4225
hfenergy: -906.1004409 hartree
pointgroup: C01 [X(C18H27N1O2)]
dipole: -0.5734911 0.5612781 -0.1411418 debye
polarizability: 241.8814194|12.4068192|224.6354986|-11.7120835|2.3395357|146.7921274 unknown
InChI: InChI=1S/C18H27NO2/c1-15(2)17-11-6-7-12-19(17)13-8-14-21-18(20)16-9-4-3-5-10-16/h3-5,9-10,15,17H,6-8,11-14H2,1-2H3
charge 0 multiplicity 1
48 atoms
O  1.636316 -1.052638 0.5566
O  3.421641 -2.412109 -0.070159
N  -2.611485 -0.479997 0.400573
C  -3.051069 0.719369 -0.386873
C  -3.684851 0.291559 -1.747581
C  -3.960379 1.650977 0.48095
C  -3.703834 -1.47307 0.588566
C  -4.84852 -0.711354 -1.551821
C  -4.36999 -1.93709 -0.736372
C  -1.316898 -1.060934 -0.024994
C  -3.222679 2.069008 1.774713
C  -4.412797 2.90544 -0.3056
C  -0.602143 -1.809195 1.124272
C  0.801193 -2.278521 0.742311
C  2.957666 -1.26577 0.155933
C  3.72311 0.010492 0.037341
C  5.070641 -0.06087 -0.401732
C  3.147088 1.268474 0.354098
C  5.835937 1.116841 -0.525128
C  3.917628 2.444186 0.230873
C  5.260995 2.371274 -0.208828
H  -2.132353 1.304742 -0.602197
H  -4.024081 1.175962 -2.317556
H  -2.8971 -0.192606 -2.361023
H  -4.871569 1.090813 0.776269
H  -3.300733 -2.340069 1.142816
H  -4.479115 -1.022106 1.239425
H  -5.687296 -0.217717 -1.018994
H  -5.244525 -1.0314 -2.534795
H  -3.643184 -2.518553 -1.339284
H  -5.216535 -2.615076 -0.510312
H  -0.66376 -0.229231 -0.347193
H  -1.404807 -1.754269 -0.900087
H  -2.831431 1.179913 2.29771
H  -3.896667 2.623283 2.45458
H  -2.364736 2.729382 1.537824
H  -3.539213 3.439185 -0.729364
H  -4.939211 3.608831 0.366051
H  -5.099752 2.662916 -1.136081
H  -1.182043 -2.704501 1.424167
H  -0.550059 -1.144367 2.00572
H  1.2677 -2.894884 1.531873
H  0.815651 -2.856247 -0.201145
H  5.493439 -1.04323 -0.637046
H  2.109062 1.309909 0.695543
H  6.875738 1.060134 -0.864793
H  3.474446 3.41501 0.478049
H  5.856863 3.286206 -0.3029
