program: Gaussian 09
title: 000045205
version: EM64L-G09RevD.01
frameworkgroup: C1[X(C4H8Cl2N2O)]
method: RPBEPBE
basis: SDD
operation: Freq
keyword: #p
keyword: freq=noraman
keyword: PBEPBE/SDD
title: #p freq=noraman PBEPBE/SDD
converged: YES YES NO NO
title: Mulliken charges:
elementType: Cl Cl O N N C C C C H H H H H H H H
charge: -0.034577 -0.040501 -0.259331 -0.072895 0.062416 -0.327480 -0.346926 -0.566148 -0.566349 0.246061 0.270948 0.279821 0.240562 0.266812 0.281837 0.306448 0.259303
chargesum: 0.00000
title: Mulliken charges with hydrogens summed into heavy atoms:
elementType: Cl Cl O N N C C C C
charge: -0.034577 -0.040501 -0.259331 -0.072895 0.062416 0.189530 0.173457 -0.017499 -0.000599
polarizability: 1.07930704e+02 -4.09706929e+00 8.37760093e+01 2.24471048e+00 -7.09352481e+00 5.37255677e+01
1716.lowfreq: -5.9442 -3.4345 -0.0017 0.0011 0.0030 9.4026 39.8036 66.2447 70.2509
frequency: 39.7799 66.2296 70.2399 81.9153 105.3167 190.6602 219.6468 246.3786 311.9738 355.1714 383.1157 447.1347 645.6540 687.4914 715.5816 774.1265 779.8818 846.0765 943.7758 992.1744 1041.1096 1049.5434 1059.9537 1124.6835 1220.4590 1239.4374 1259.6222 1262.4712 1299.3338 1326.5317 1339.6743 1358.1166 1364.9955 1440.8403 1453.8284 1458.2060 1464.2549 3017.5490 3019.2203 3057.4510 3069.1767 3093.0918 3095.7748 3145.9909 3160.9712
redmass: 11.1461 4.1339 2.3007 3.2597 5.2757 4.9623 8.4943 4.5714 6.2596 5.2572 3.0447 6.8045 5.9706 6.6279 3.1413 1.4409 1.1762 4.6803 2.7706 1.4891 2.6687 3.6546 1.8294 1.3228 1.7665 1.8985 1.2046 1.2082 1.2714 1.7057 1.7103 1.5185 1.5611 1.0940 1.0810 1.0932 1.0930 1.0608 1.0606 1.0568 1.0575 1.1027 1.1028 1.1120 1.1110
irintensity: 1.1623 4.5776 1.9036 3.6417 6.2334 1.2841 6.9852 0.5095 4.2209 8.3536 6.7991 10.0408 30.6031 49.4101 25.8889 0.2774 13.7814 48.1685 112.6267 1.7009 8.4443 4.3228 42.9592 7.6708 25.4726 0.7530 12.2196 17.7428 14.2239 63.6723 21.8494 8.2929 40.9485 15.1062 2.0044 10.0988 23.1374 2.3272 17.2150 20.2412 19.4751 3.4804 1.1812 11.1409 6.1075
temp: 298.150 k
press: 1.00000 atm
elementType: 17 17 8 7 7 6 6 6 6 1 1 1 1 1 1 1 1
symmnumber: 1
zpe: 330914.7 jmol-1
zpe.correction: 0.126039 hartree
zpe.thermalcorrener: 0.136691 hartree
zpe.thermalcorrenthalpy: 0.137635 hartree
zpe.thermalcorrgfe: 0.087091 hartree
zpe.sumelectzpe: -1261.276761 hartree
zpe.sumelectthermal: -1261.266109 hartree
zpe.sumelectthermalent: -1261.265165 hartree
zpe.sumelectthermalfe: -1261.315709 hartree
dipole: 1.2164 -1.6222 0.6379
dipole: 2.1256
quadrupole: -82.4651 -80.5933 -64.1113
quadrupole: 2.6902 -0.1253 2.5562
quadrupole: -6.7419 -4.8700 11.6119 2.6902 -0.1253 2.5562
hfenergy: -1261.4027999 hartree
pointgroup: C01 [X(C4H8Cl2N2O1)]
dipole: -0.375882 -0.7311351 -0.1532946 debye
dipolederiv: -0.5511059 -0.2288711 -0.0108342 -0.2117034 -0.2860764 0.0034668 -0.0579857 -0.0182645 -0.1772593 -0.5123654 0.2316261 -0.0761398 0.2450735 -0.3115582 0.0522844 -0.0211832 0.0248166 -0.1928654 -0.6151512 -0.8729756 -0.1029426 -0.1160135 -0.7244999 -0.03207 -0.1252828 -0.1723134 -0.2193236 -0.2799435 -0.0236558 -0.0145911 -0.4820143 -0.9774125 -0.0638864 -0.0708417 0.0973931 -0.3017555 0.1268112 0.7075038 0.0717075 0.50715 1.3856799 0.1778289 0.1746093 0.2536165 -0.0382669 0.4045223 0.2040375 0.0359351 0.2349643 0.1374321 0.0496619 -0.0918657 -0.0200325 0.2287159 0.1569676 -0.0070939 -0.0356584 -0.0780608 0.0941882 -0.0238902 0.0552115 -0.0468793 0.1902386 0.6638367 0.2245456 0.0480046 0.2231238 0.3204753 0.0413199 0.0834418 0.0486559 0.1287156 0.6398406 -0.2776476 0.0670155 -0.2652104 0.3029852 -0.0533667 0.0128444 -0.0986206 0.1330002 0.0213681 -0.031988 0.0413553 -0.0520732 0.0177721 -0.0987593 0.0236049 -0.0678186 -0.0476668 0.0070173 0.0307199 -0.0257871 0.0778188 0.0259277 0.0420867 0.0080406 0.0200437 0.1030972 0.0072172 0.0119282 0.0478907 -0.0665214 0.0428989 0.0719934 0.0120428 0.0293862 0.042361 0.0758338 -0.0122902 -0.0504664 -0.0184687 -0.0278823 -0.0791303 -0.0646897 -0.0582677 0.0409897 -0.085574 0.0629433 -0.0585819 0.0526872 -0.0240106 0.0319849 -0.0205066 0.0187859 0.0616365 0.0122855 -0.0415858 -0.0149213 -0.0369267 0.0203024 -0.0934905 0.0135038 -0.0450069 -0.0373581 0.0152513 0.0418876 -0.0136134 -0.0100226 -0.0087359 -0.0872306 0.0054957 -0.0202815 0.0691132 -0.0868116 -0.0190842 0.0916274 -0.0038025 0.012514 0.0611972 0.0635608 0.0547871 0.016628 unknown
polarizability: 105.4481424|7.0287224|86.8103351|7.5486184|1.1426431|53.1738035 unknown
InChI: InChI=1S/C4H8Cl2N2O/c5-1-3-8(7-9)4-2-6/h1-4H2
charge 0 multiplicity 1
17 atoms
Cl -3.49817 -1.744775 -0.076256
Cl 3.330448 -1.514057 0.763332
O  1.041253 2.440652 -0.033952
N  -0.064798 0.535291 -0.471348
N  -0.106604 1.914241 -0.267486
C  -1.363545 -0.096514 -0.768402
C  1.219404 -0.207911 -0.499941
C  -1.849155 -0.970571 0.401167
C  1.773962 -0.458933 0.913153
H  -1.283897 -0.707832 -1.685816
H  -2.082552 0.719138 -0.952014
H  1.951381 0.394052 -1.069074
H  1.050543 -1.163352 -1.024349
H  -1.177609 -1.816088 0.614123
H  -2.035962 -0.37857 1.308885
H  2.082177 0.474448 1.402307
H  1.083524 -1.033619 1.547869
