program: Gaussian 09
title: 000045187
version: EM64L-G09RevD.01
frameworkgroup: C1[X(C9H17N)]
method: RPBEPBE
basis: SDD
operation: Freq
keyword: #pfreq=noraman
keyword: PBEPBE/SDD
title: #p freq=noraman PBEPBE/SDD
converged: YES YES NO NO
title: Mulliken charges:
elementType: N C C C C C C C C C H H H H H H H H H H H H H H H H H
charge: -0.640049 -0.178655 -0.148519 0.343106 -0.090994 -0.540797 -0.475967 -0.495005 -0.767725 -0.764084 0.229209 0.227406 0.200991 0.219238 0.226534 0.191694 0.224368 0.225094 0.206967 0.201626 0.212257 0.233898 0.212071 0.212218 0.222439 0.253817 0.258861
chargesum: 0.00000
title: Mulliken charges with hydrogens summed into heavy atoms:
elementType: N C C C C C C C C C
charge: -0.127371 0.050554 0.078887 0.343106 0.109997 -0.095025 -0.059905 -0.062943 -0.119943 -0.117356
polarizability: 1.02074985e+02 2.00851049e-01 9.73524774e+01 -1.49325411e+00 -1.57947613e-01 9.03080156e+01
1716.lowfreq: -18.8641 -0.0007 -0.0006 -0.0005 4.7693 27.6014 90.8496 204.8078 238.9179
frequency: 90.6462 204.7943 238.9158 242.1185 263.3466 270.0811 298.9256 312.9808 363.3861 411.3125 428.0129 469.5514 477.7621 570.3686 600.6741 672.7119 727.4503 748.2226 800.4749 815.0572 871.4345 896.9856 910.0105 932.3697 945.6132 961.3344 972.8841 987.0922 1010.2803 1038.0614 1052.9844 1059.9919 1083.3469 1097.8800 1120.5476 1147.7447 1163.5389 1188.1094 1204.0040 1223.4749 1233.5992 1260.8907 1271.9810 1283.5006 1296.7720 1307.2263 1318.2974 1347.4248 1376.1513 1388.6902 1462.3766 1465.3998 1468.6835 1476.3591 1483.8424 1488.3269 1497.3735 1635.8412 2973.2713 2976.3432 2979.7017 2988.2546 3004.0652 3005.3423 3032.6534 3040.6637 3049.4305 3061.0819 3064.3794 3067.4691 3074.2684 3075.9529 3102.8389 3435.5324 3568.9493
redmass: 2.6953 1.1925 1.7995 1.3414 2.1287 1.2886 1.7367 1.8097 2.5712 2.4956 2.2887 2.1986 2.4707 3.0511 1.5517 2.8628 3.7971 3.8521 1.4280 1.9363 2.1713 2.2663 2.2673 2.7139 1.7861 1.5424 1.7160 1.4258 1.6261 1.5470 1.6098 1.4682 1.4146 1.3250 1.5082 1.9384 1.9514 2.0367 1.8571 1.5075 1.7014 1.3568 1.6856 1.5224 1.4783 1.6708 1.8159 1.4302 1.2422 1.2026 1.0493 1.0531 1.0796 1.0839 1.0544 1.0720 1.0777 1.0982 1.0360 1.0647 1.0587 1.0591 1.0631 1.0607 1.0880 1.1021 1.0918 1.0981 1.1020 1.0971 1.1015 1.0999 1.0994 1.0445 1.0971
irintensity: 0.3868 1.2449 0.9137 2.7747 9.2693 14.2089 0.0034 12.6726 4.9680 6.3040 5.1745 0.6060 27.0907 1.3529 223.2403 2.4624 0.5887 10.2640 0.7319 7.8780 2.4114 2.6290 0.3140 2.4124 3.4913 0.3877 6.4620 3.6925 2.2545 2.8714 1.9393 2.8854 7.6710 13.1259 4.6624 3.9515 2.4378 8.0128 6.8646 3.0650 2.9658 1.1822 1.3064 0.1970 3.1070 9.3450 5.6350 0.9960 11.3003 23.6112 15.0987 0.7133 2.5340 10.1286 8.4171 8.7187 19.0511 41.9164 32.3791 41.2954 17.3888 33.2357 64.4613 47.2904 82.2546 6.8972 14.4206 68.3991 26.2107 50.2436 77.7346 20.0907 34.8823 2.5979 0.3966
temp: 298.150 k
press: 1.00000 atm
elementType: 7 6 6 6 6 6 6 6 6 6 1 1 1 1 1 1 1 1 1 1 1 1 1 1 1 1 1
symmnumber: 1
zpe: 642618.5 jmol-1
zpe.correction: 0.244760 hartree
zpe.thermalcorrener: 0.254702 hartree
zpe.thermalcorrenthalpy: 0.255646 hartree
zpe.thermalcorrgfe: 0.211051 hartree
zpe.sumelectzpe: -407.081711 hartree
zpe.sumelectthermal: -407.071770 hartree
zpe.sumelectthermalent: -407.070826 hartree
zpe.sumelectthermalfe: -407.115421 hartree
dipole: 0.9789 -0.4478 0.3538
dipole: 1.1331
quadrupole: -65.9484 -60.6246 -63.6374
quadrupole: -0.4805 -2.3047 0.0413
quadrupole: -2.5450 2.7789 -0.2339 -0.4805 -2.3047 0.0413
hfenergy: -407.3264718 hartree
pointgroup: C01 [X(C9H17N1)]
dipole: 0.3812611 -0.1924552 0.1277706 debye
polarizability: 102.0235654|0.0727826|97.3454424|-1.7142258|0.0527181|90.3664697 unknown
InChI: InChI=1S/C9H17N/c1-6-7-3-4-8(5-7)9(6,2)10/h6-8H,3-5,10H2,1-2H3
charge 0 multiplicity 1
27 atoms
N  -1.035276 -1.533565 -1.170092
C  0.557218 -0.883659 0.800436
C  0.895561 1.221486 0.000556
C  -0.770529 -0.617266 -0.036047
C  -0.495643 0.850198 -0.608025
C  0.846515 0.526039 1.392259
C  1.771459 -1.062717 -0.153836
C  1.999607 0.389974 -0.719618
C  -1.995781 -0.735097 0.90142
C  -1.582607 1.904893 -0.32049
H  0.438072 -1.706197 1.528411
H  1.090825 2.307757 0.007122
H  -0.406193 0.764725 -1.709985
H  1.806579 0.579803 1.937854
H  0.047671 0.910186 2.049561
H  1.578563 -1.809242 -0.94579
H  2.65405 -1.412828 0.411737
H  3.007945 0.763337 -0.46239
H  1.898336 0.440148 -1.819851
H  -2.131762 -1.79206 1.20483
H  -1.879797 -0.139752 1.823053
H  -2.91583 -0.414324 0.385665
H  -1.715025 2.081838 0.762923
H  -1.307146 2.870515 -0.785204
H  -2.559666 1.600532 -0.736683
H  -1.242234 -2.499368 -0.891016
H  -0.343511 -1.491456 -1.925498
