program: Gaussian 09
title: 000045181
version: EM64L-G09RevD.01
frameworkgroup: C1[X(C9H20N4)]
method: RPBEPBE
basis: SDD
operation: Freq
keyword: #pfreq=noraman
keyword: PBEPBE/SDD
title: #p freq=noraman PBEPBE/SDD
converged: YES YES NO NO
title: Mulliken charges:
elementType: N N N N C C C C C C C C C H H H H H H H H H H H H H H H H H H H H
charge: -0.628511 -0.610621 -0.345674 -0.335874 -0.386153 -0.363189 -0.361372 -0.388645 -0.370494 -0.464149 -0.537240 0.127347 0.119486 0.193683 0.199321 0.189359 0.200330 0.193741 0.192785 0.224330 0.185637 0.214524 0.209607 0.204546 0.241503 0.206920 0.222927 0.306077 0.311919 0.305531 0.324956 0.199337 0.218056
chargesum: 0.00000
title: Mulliken charges with hydrogens summed into heavy atoms:
elementType: N N N N C C C C C C C C C
charge: -0.010515 0.019866 -0.146336 -0.117818 0.006851 0.026501 0.025154 0.021322 0.053638 -0.018101 -0.107393 0.127347 0.119486
polarizability: 1.59335804e+02 7.97275734e+00 1.24976170e+02 2.27716326e+00 4.16517803e+00 9.84129915e+01
1716.lowfreq: -0.0002 0.0007 0.0010 4.0686 10.0928 14.8560 19.3918 24.3395 40.9070
frequency: 18.0045 24.2903 40.1631 45.6379 49.7991 94.4912 95.8957 116.0959 145.1739 145.9975 151.2613 247.4462 273.6242 317.3052 392.1357 398.3444 412.1207 415.6094 431.2119 449.8710 507.5415 520.0321 546.6237 642.1302 671.5295 726.5771 736.1919 761.0605 796.2532 817.6812 837.4806 861.9729 871.3042 897.2277 979.0607 997.3256 1005.7041 1033.1739 1040.9248 1051.5719 1071.5897 1080.8860 1081.7136 1095.0941 1105.1958 1116.2859 1123.2525 1205.9452 1211.3903 1244.6296 1252.6434 1273.6780 1283.2541 1290.4628 1294.7572 1295.2728 1321.6602 1344.0101 1358.4044 1360.6153 1377.3226 1399.1039 1457.0849 1462.0378 1464.6453 1466.1740 1474.0048 1483.0417 1489.1858 1590.6303 1614.8868 1641.0788 1645.9691 2953.2016 2954.4028 2961.1999 2968.1988 2974.1604 2978.7487 2981.8904 2989.2529 3000.7357 3019.0334 3031.0629 3042.1941 3057.4241 3087.2667 3291.6240 3372.5171 3527.6080 3549.2105 3674.3611 3707.6411
redmass: 3.9733 4.5468 3.8081 3.3992 2.6297 2.2488 2.1218 3.9172 2.0844 2.2131 4.2493 3.7052 3.7614 1.1946 1.2437 2.5419 2.6908 2.3443 2.0108 1.2856 2.4220 2.5324 1.2240 3.4003 4.7004 1.0662 1.0909 1.1630 1.1223 1.2717 1.3826 3.7505 3.5743 1.3483 1.3171 4.3442 4.1989 1.4684 3.1313 1.3675 2.5521 2.1728 4.2870 1.4683 1.5073 1.5294 1.3367 1.5499 1.2230 1.3359 1.2890 1.2223 1.0447 1.2900 1.1365 1.0889 1.3347 1.4158 1.5226 1.6558 3.1684 3.3129 1.0820 1.0753 1.0747 1.0802 1.1022 1.1040 1.1027 1.4752 1.5722 2.4694 2.9173 1.0592 1.0593 1.0601 1.0620 1.0609 1.0679 1.0603 1.0963 1.0986 1.1004 1.1009 1.1026 1.1039 1.0964 1.0755 1.0761 1.0447 1.0454 1.1038 1.1036
irintensity: 9.8827 8.6782 0.7449 1.0113 3.0936 0.8568 1.1281 1.2560 0.4699 0.1105 0.6760 4.6151 4.1810 145.0324 215.3465 26.2879 7.7970 5.2193 47.0679 22.7647 13.9697 22.7754 143.5834 9.0431 20.8306 10.2393 1.8578 0.5851 48.7163 1.0199 79.0729 0.9837 8.0704 1.4633 1.2860 1.4745 2.6463 11.0225 1.4009 0.3901 4.2190 0.0463 5.9991 60.2805 134.0949 8.0180 48.9011 2.6391 19.6383 4.5967 0.5926 4.1554 0.3483 1.0332 1.7136 0.2931 3.0337 3.2964 0.8351 1.8417 109.3666 73.8740 6.0510 0.7606 0.5950 1.3950 6.7497 1.3161 34.8576 40.3816 72.3195 206.6075 279.6409 2.1978 0.7324 23.6033 69.0373 2.4484 33.8935 92.0298 3.5724 4.4421 3.7003 1.8103 68.7841 111.2793 26.3669 43.7129 12.1006 13.0623 32.3309 11.4095 25.0943
temp: 298.150 k
press: 1.00000 atm
elementType: 7 7 7 7 6 6 6 6 6 6 6 6 6 1 1 1 1 1 1 1 1 1 1 1 1 1 1 1 1 1 1 1 1
symmnumber: 1
zpe: 763597.2 jmol-1
zpe.correction: 0.290839 hartree
zpe.thermalcorrener: 0.307423 hartree
zpe.thermalcorrenthalpy: 0.308367 hartree
zpe.thermalcorrgfe: 0.243339 hartree
zpe.sumelectzpe: -572.891888 hartree
zpe.sumelectthermal: -572.875304 hartree
zpe.sumelectthermalent: -572.874360 hartree
zpe.sumelectthermalfe: -572.939388 hartree
dipole: -1.7232 1.1401 0.0545
dipole: 2.0670
quadrupole: -104.6999 -79.2974 -80.5762
quadrupole: -37.0253 5.6009 2.8200
quadrupole: -16.5087 8.8937 7.6150 -37.0253 5.6009 2.8200
hfenergy: -573.1827269 hartree
pointgroup: C01 [X(C9H20N4)]
dipole: 0.6766469 -0.438593 -0.1054027 debye
polarizability: 159.3920689|8.1668297|125.0506052|0.1906608|3.7346504|98.282291 unknown
InChI: InChI=1S/C9H20N4/c10-8(11)6-4-2-1-3-5-7-9(12)13/h10,12H,1-7,11,13H2
charge 0 multiplicity 1
33 atoms
N  5.450014 -1.146265 -0.763317
N  -5.625734 1.127832 -0.564365
N  5.897982 1.141271 -0.091029
N  -5.721554 -1.200044 -0.478122
C  0.021239 -0.011377 -0.130689
C  1.311676 0.024758 0.718668
C  -1.268413 0.030649 0.719839
C  2.599628 -0.021342 -0.133464
C  -2.556175 -0.017994 -0.132304
C  3.883563 0.020829 0.737579
C  -3.845647 0.017389 0.732928
C  5.170358 0.043835 -0.077601
C  -5.118376 -0.085853 -0.114508
H  0.017577 -0.929147 -0.755355
H  0.02419 0.844718 -0.836866
H  1.307818 -0.82917 1.42865
H  1.318651 0.944888 1.338839
H  -1.268037 0.951742 1.33977
H  -1.266534 -0.82266 1.430245
H  2.615411 0.838155 -0.831872
H  2.587005 -0.935968 -0.761844
H  -2.557737 -0.939316 -0.748006
H  -2.563064 0.833472 -0.841612
H  3.889327 -0.847038 1.428862
H  3.883837 0.937187 1.350013
H  -3.852342 0.945426 1.339525
H  -3.827749 -0.829208 1.445048
H  4.826606 -1.948171 -0.698486
H  6.273856 -1.228223 -1.356053
H  -5.221063 2.015555 -0.284754
H  -6.447474 1.112465 -1.165604
H  6.749192 1.062745 -0.69011
H  -5.247831 -2.035939 -0.087103
