program: Gaussian 09
title: 000045150
version: EM64L-G09RevD.01
frameworkgroup: C1[X(C16H19NO3)]
method: RPBEPBE
basis: SDD
operation: Freq
keyword: #p
keyword: freq=noraman
keyword: PBEPBE/SDD
title: #p freq=noraman PBEPBE/SDD
converged: YES YES NO NO
title: Mulliken charges:
elementType: O O O N C C C C C C C C C C C C C C C C H H H H H H H H H H H H H H H H H H H
charge: -0.258965 -0.274943 -0.201450 -0.092800 -0.358906 0.130124 0.435483 -0.257405 0.249136 -0.368869 -0.452467 -0.378523 -0.422873 -0.612557 -0.612689 -0.245047 -0.383698 -0.236488 -0.237468 0.225461 0.224485 0.195834 0.235600 0.243948 0.284761 0.237040 0.244595 0.236823 0.227348 0.225103 0.191382 0.225071 0.190787 0.228413 0.223510 0.242034 0.242839 0.229335 0.226036
chargesum: 0.00000
title: Mulliken charges with hydrogens summed into heavy atoms:
elementType: O O O N C C C C C C C C C C C C C C C C
charge: -0.258965 -0.274943 -0.201450 -0.092800 0.061413 0.130124 0.435483 0.222144 0.249136 -0.084108 -0.215427 -0.133928 -0.186050 0.031275 0.031582 -0.021537 0.101175 -0.007153 -0.011432 0.225461
polarizability: 2.70382848e+02 1.64660044e+01 2.15227888e+02 -3.76133868e+00 2.52507704e+00 1.01383478e+02
1716.lowfreq: -14.9733 -5.7430 -1.2362 -0.0003 0.0007 0.0010 8.3731 15.4772 25.9567
frequency: -10.5466 14.0325 25.9470 31.9791 46.1522 75.8355 94.0919 114.9366 138.0656 156.5616 170.3516 187.2996 200.3586 212.2981 232.3233 260.6088 265.4541 298.3333 345.4707 388.4655 420.2429 423.8769 449.6680 471.1598 478.8544 505.5724 540.9467 564.4728 575.3319 585.4479 641.6761 672.8879 731.9472 742.1382 783.0624 783.4978 797.8894 808.6629 815.0621 853.6286 863.8528 891.9868 894.5483 931.8507 962.7649 977.6518 993.2511 999.9943 1004.4718 1024.0758 1033.7306 1034.3990 1064.5146 1071.3757 1087.8292 1093.6577 1095.5997 1126.2072 1139.9471 1148.8838 1172.0290 1173.0170 1186.3990 1199.4847 1231.7867 1237.2914 1243.0177 1265.7410 1270.6084 1287.1624 1325.0072 1356.6569 1379.2702 1388.5036 1404.8684 1420.4124 1429.9000 1439.3750 1442.7196 1448.3308 1461.1157 1461.7478 1466.5254 1473.4184 1476.2934 1483.3249 1486.6404 1516.7159 1583.9973 1597.3067 1636.0382 1678.0716 2855.6393 2862.4160 2879.4159 2960.9343 3017.9675 3022.3637 3023.4029 3032.9330 3044.2187 3080.4009 3088.1398 3098.5607 3121.6146 3128.0580 3136.9924 3147.3805 3155.2390 3165.2071 3173.2038
redmass: 2.9874 4.6997 6.7693 4.5310 4.9648 2.4187 3.2413 2.8888 4.2785 5.2645 3.6148 3.7339 2.5620 1.0910 1.6527 4.3000 3.2081 4.5294 2.5161 3.5148 3.1372 2.6004 3.4790 3.2906 5.7796 6.2187 5.4406 3.3257 3.3320 7.2701 3.2285 6.0722 6.8361 1.3184 3.2212 1.9689 1.2043 1.9996 4.0159 5.1368 1.4387 6.3702 1.6276 6.6795 1.3294 1.3847 5.7824 1.3319 1.8635 2.4435 1.9848 1.6883 1.6167 2.5090 1.5652 2.8724 2.0221 3.0407 1.5609 1.4570 1.2522 1.2225 1.2830 1.0813 1.8036 1.7376 2.5271 2.5290 1.7836 1.2438 1.3488 1.5385 2.0815 1.5155 3.2803 1.1448 4.7073 2.5109 1.1671 1.6270 1.4455 1.0688 1.0693 1.0647 1.0611 1.0710 1.0638 3.9161 7.0385 5.7182 6.9744 10.8567 1.0566 1.0612 1.0656 1.0558 1.1033 1.0729 1.0585 1.0719 1.0888 1.1013 1.1011 1.1081 1.0861 1.0859 1.0903 1.0928 1.0959 1.0974 1.0980
irintensity: 0.1866 0.2963 0.2166 0.6759 0.3813 0.2231 2.6989 5.7747 5.5656 0.7456 6.5599 0.2539 1.9476 1.1577 0.3688 1.1540 13.6686 1.0044 16.5705 0.3475 6.8083 10.6219 7.0802 0.1352 1.3172 0.6947 0.4540 0.1737 13.7906 0.6547 0.6160 7.9599 17.4193 3.0236 24.5358 70.4762 4.5707 68.1147 15.7407 9.3728 0.0488 3.2311 2.4814 28.4352 0.0115 5.5399 32.8267 0.2952 0.8842 32.2368 73.0462 24.3150 1.7439 113.1085 4.7632 193.0883 13.2021 505.8768 38.1431 0.1039 4.0303 4.6672 12.6919 4.8925 17.6721 12.2349 74.2787 11.9522 27.5395 3.1200 3.2720 3.1469 40.0202 21.2727 28.4079 2.5018 29.7294 13.7008 3.6193 50.9990 6.5741 15.0041 4.8824 17.4842 7.0808 16.2991 17.0968 29.8374 74.9317 5.8442 8.2035 168.1153 70.9049 100.7233 171.3312 51.7688 16.5991 45.1870 4.4296 53.7399 10.6856 23.8342 49.3150 32.3865 1.4159 0.8241 17.0469 33.8275 31.5156 20.4710 13.0185
temp: 298.150 k
press: 1.00000 atm
elementType: 8 8 8 7 6 6 6 6 6 6 6 6 6 6 6 6 6 6 6 6 1 1 1 1 1 1 1 1 1 1 1 1 1 1 1 1 1 1 1
symmnumber: 1
zpe: 831177.6 jmol-1
zpe.correction: 0.316579 hartree
zpe.thermalcorrener: 0.335484 hartree
zpe.thermalcorrenthalpy: 0.336429 hartree
zpe.thermalcorrgfe: 0.266531 hartree
zpe.sumelectzpe: -900.017725 hartree
zpe.sumelectthermal: -899.998819 hartree
zpe.sumelectthermalent: -899.997875 hartree
zpe.sumelectthermalfe: -900.067772 hartree
dipole: 2.6451 2.7421 0.8937
dipole: 3.9133
quadrupole: -91.7809 -112.9135 -122.9207
quadrupole: 2.8003 3.7574 -2.2542
quadrupole: 17.4241 -3.7085 -13.7156 2.8003 3.7574 -2.2542
hfenergy: -900.3343034 hartree
pointgroup: C01 [X(C16H19N1O3)]
dipole: -1.009336 0.9866158 -0.6150495 debye
polarizability: 269.7217781|-17.2128224|208.6952661|3.7005107|-28.1010683|108.5771693 unknown
InChI: InChI=1S/C16H19NO3/c1-17(2)10-11-19-16(18)12-20-15-9-5-7-13-6-3-4-8-14(13)15/h3-9H,10-12H2,1-2H3
charge 0 multiplicity 1
39 atoms
O  0.733513 -0.208424 0.015405
O  -2.837014 0.355537 -0.060707
O  -1.619272 -1.512735 0.645432
N  -6.553839 -0.131147 -0.16298
C  -5.226029 0.462836 -0.439007
C  3.119916 -0.368058 -0.01371
C  4.42216 0.227631 -0.217798
C  -4.118909 -0.352448 0.240017
C  1.952503 0.457028 -0.206175
C  3.019839 -1.743415 0.371284
C  4.518035 1.608156 -0.601978
C  2.06618 1.800902 -0.581282
C  5.585525 -0.58888 -0.026393
C  -6.824453 -1.3519 -0.952028
C  -7.65196 0.850608 -0.277294
C  3.364204 2.370173 -0.777753
C  -0.485605 0.564843 -0.128105
C  4.175145 -2.510392 0.548952
C  5.467036 -1.929623 0.348604
C  -1.661107 -0.350234 0.205497
H  -5.206774 1.486822 -0.024148
H  -5.007138 0.546685 -1.532901
H  -4.043533 -1.387236 -0.136296
H  -4.263517 -0.38204 1.33359
H  2.025947 -2.173917 0.523252
H  5.50815 2.052056 -0.754665
H  1.183344 2.429231 -0.730852
H  6.574409 -0.140535 -0.18009
H  -7.790953 -1.78392 -0.638218
H  -6.046412 -2.112948 -0.771513
H  -6.871332 -1.158157 -2.053927
H  -8.601264 0.378217 0.032782
H  -7.789968 1.247754 -1.314842
H  -7.462353 1.705138 0.395914
H  3.438307 3.422911 -1.071495
H  -0.499055 1.431611 0.564953
H  -0.607267 0.950131 -1.160549
H  4.093951 -3.562171 0.844253
H  6.364387 -2.541989 0.491672
