program: Gaussian 09
title: 000045177
version: EM64L-G09RevD.01
frameworkgroup: C1[X(C21H26N2O)]
method: RPBEPBE
basis: SDD
operation: Freq
keyword: #p
keyword: freq=noraman
keyword: PBEPBE/SDD
title: #p freq=noraman PBEPBE/SDD
converged: YES YES NO NO
title: Mulliken charges:
elementType: O N N C C C C C C C C C C C C C C C C C C C C C H H H H H H H H H H H H H H H H H H H H H H H H H H
charge: -0.289149 -0.080156 -0.390974 -0.380927 -0.355897 -0.393774 -0.392612 -0.397699 -0.389255 -0.432555 -0.168236 0.437622 -0.397227 -0.400167 0.160121 -0.237018 -0.241885 0.260805 -0.239659 -0.360290 -0.357825 -0.223348 -0.237085 -0.227709 0.260515 0.160055 0.166853 0.201299 0.208943 0.187801 0.203301 0.186492 0.185630 0.210589 0.189168 0.231137 0.184560 0.212646 0.284131 0.299883 0.248249 0.246344 0.227219 0.224386 0.229322 0.272314 0.221342 0.231537 0.229348 0.231835
chargesum: 0.00000
title: Mulliken charges with hydrogens summed into heavy atoms:
elementType: O N N C C C C C C C C C C C C C C C C C C C C C
charge: -0.289149 -0.080156 -0.091091 0.039643 0.012255 0.002970 -0.002819 -0.001479 0.031051 -0.035348 0.115895 0.437622 -0.148978 -0.153823 0.160121 -0.009800 -0.017499 0.260805 -0.010337 -0.087976 -0.136483 0.008189 -0.007738 0.004126
polarizability: 2.59810925e+02 1.01657982e+01 2.77546148e+02 1.47860095e-01 -1.34502707e+01 1.81955359e+02
1716.lowfreq: -9.1113 -6.3136 -0.0005 0.0000 0.0004 5.6241 15.1618 25.7935 26.9963
frequency: 14.7366 25.7414 26.8430 29.5489 32.5192 49.9882 61.8848 85.3580 117.0510 123.9993 147.5881 162.8106 209.7856 239.5198 253.1026 260.7294 269.9376 314.1460 351.0228 363.7829 378.1448 401.7800 402.6161 408.4756 417.4381 452.9104 456.2423 470.3125 500.1183 537.6429 552.5831 573.8722 614.8110 616.5446 618.8547 659.4037 685.3391 702.5714 707.0482 725.4713 766.3005 782.2748 790.9064 805.7698 835.0384 851.1407 854.4807 857.9295 858.1163 884.7566 903.5531 923.4572 933.0005 935.1591 960.1650 980.0976 982.6746 983.8102 989.6090 991.0888 997.1138 1004.0642 1014.8850 1024.9353 1027.8942 1047.6919 1049.1269 1065.5102 1082.2512 1094.0840 1099.7495 1108.8084 1120.2925 1133.8005 1150.4133 1160.1669 1172.6115 1172.6828 1179.5999 1188.9134 1190.1397 1206.9293 1228.2886 1255.5195 1259.0574 1267.2050 1277.6204 1295.7998 1302.8299 1314.5320 1322.9227 1327.9903 1332.3541 1339.2520 1342.1121 1352.0338 1358.7399 1367.4978 1383.8859 1384.1348 1392.6244 1431.6757 1439.6021 1447.7234 1452.5622 1460.2973 1464.0402 1465.8538 1469.4012 1475.9135 1482.3845 1484.1718 1490.6209 1567.3329 1591.9186 1601.5628 1610.6927 1612.8481 2810.5540 2823.5256 2872.9958 2964.3058 2976.6102 2981.8749 2986.4924 3015.7713 3018.6894 3030.2865 3034.4488 3043.7261 3048.0478 3051.4687 3054.0718 3117.7907 3120.5097 3125.5185 3130.9168 3138.0836 3143.7840 3147.8187 3157.0712 3163.2260 3168.7079 3536.3514
redmass: 4.3680 4.1171 3.9677 4.0489 4.7871 3.2434 5.7493 5.2193 4.2812 3.4586 4.1451 4.4022 3.8237 2.2691 2.8875 4.0351 2.8387 3.8628 2.4574 3.5204 1.9450 2.8328 2.8080 2.7858 4.2093 2.8786 2.9834 3.3156 2.9321 1.7436 2.6524 1.4197 6.3114 6.3191 4.2398 6.3107 4.9376 1.5375 1.7208 2.9411 1.9264 3.9021 2.3580 1.4764 2.4760 1.9024 1.2956 1.2795 1.6762 3.6069 2.3530 1.5583 2.0614 1.5759 1.3100 1.4732 1.6460 1.7912 5.1442 6.0862 1.3352 1.3450 2.4634 2.3084 2.2239 2.1964 2.1416 1.9694 1.5604 1.7492 2.0716 2.2058 2.5924 2.5936 1.4093 1.9984 1.0571 1.0583 1.4102 1.1258 1.1230 1.7057 1.6602 1.5691 1.5309 1.2389 1.5664 1.3589 1.4331 1.3310 1.3139 1.3427 1.3401 1.4086 1.4556 1.4365 1.4538 1.4121 6.1302 7.0043 1.4029 2.1858 2.1248 1.1636 1.0910 1.0876 1.1058 1.5022 1.2067 1.1017 1.1393 2.1206 2.1167 6.4170 5.9609 6.5627 6.1186 5.9875 1.0713 1.0699 1.0713 1.0620 1.0622 1.0616 1.0614 1.0866 1.0836 1.0958 1.0931 1.1027 1.0923 1.0928 1.1014 1.0871 1.0849 1.0874 1.0870 1.0919 1.0921 1.0960 1.0956 1.1015 1.1007 1.0770
irintensity: 0.8816 0.2427 0.1130 0.1521 0.0715 0.3774 5.1509 4.4804 0.3219 0.4743 0.1124 2.0202 1.6340 0.2287 0.2560 14.1991 5.1463 1.8330 2.8216 0.3853 1.5423 0.6816 0.1753 4.5623 4.5622 1.4762 1.7832 1.8749 7.7304 5.8975 24.8019 98.8943 1.2068 0.5854 16.9194 12.7508 9.1076 83.4614 64.1083 8.8965 34.0108 11.4216 20.5135 0.1611 3.2154 4.6975 4.1524 0.4742 0.8122 4.4273 3.4713 3.2244 9.3298 6.9073 4.1263 1.1773 5.2334 4.0264 1.2082 0.5293 1.3965 1.7246 9.4033 12.3641 9.2568 6.1595 5.2335 9.5724 15.5480 16.9216 22.2019 16.8360 4.5536 16.7799 10.2548 24.2948 0.3020 0.8227 15.8075 10.4765 2.3694 21.5070 2.4854 52.2764 41.9845 17.0696 3.4408 3.0168 25.1001 0.9557 6.0144 49.4987 7.7833 0.7974 19.6061 4.7802 8.3195 6.3088 3.5125 0.7848 0.4454 6.5110 18.5691 59.4920 5.2941 13.0512 16.4606 118.7118 26.2707 2.4070 11.8662 14.5216 144.1249 123.7484 2.3474 53.1149 2.8553 6.5664 61.3998 162.8690 142.4665 45.2348 45.1645 34.9805 33.5424 59.0210 11.0446 63.6315 6.1950 28.2715 13.0108 61.0404 86.0183 9.9174 3.6613 0.1158 1.6449 18.0973 22.1167 38.6415 17.6010 23.8165 23.4427 10.2136
temp: 298.150 k
press: 1.00000 atm
elementType: 8 7 7 6 6 6 6 6 6 6 6 6 6 6 6 6 6 6 6 6 6 6 6 6 1 1 1 1 1 1 1 1 1 1 1 1 1 1 1 1 1 1 1 1 1 1 1 1 1 1
symmnumber: 1
zpe: 1115511.2 jmol-1
zpe.correction: 0.424876 hartree
zpe.thermalcorrener: 0.446885 hartree
zpe.thermalcorrenthalpy: 0.447829 hartree
zpe.thermalcorrgfe: 0.369976 hartree
zpe.sumelectzpe: -998.798637 hartree
zpe.sumelectthermal: -998.776628 hartree
zpe.sumelectthermalent: -998.775684 hartree
zpe.sumelectthermalfe: -998.853537 hartree
dipole: -1.7835 1.6760 -2.3905
dipole: 3.4212
quadrupole: -129.6824 -133.2868 -142.0766
quadrupole: 0.3552 0.2577 0.1580
quadrupole: 5.3329 1.7285 -7.0613 0.3552 0.2577 0.1580
hfenergy: -999.2235127 hartree
pointgroup: C01 [X(C21H26N2O1)]
dipole: 0.726366 -0.6304573 -0.9416082 debye
polarizability: 259.3194563|9.5869713|277.6993099|0.3372293|14.6861938|182.2936656 unknown
InChI: InChI=1S/C21H26N2O/c24-21(19-12-6-2-7-13-19)22-20(18-10-4-1-5-11-18)14-17-23-15-8-3-9-16-23/h1-2,4-7,10-13,20,22H,3,8-9,14-17H2
charge 0 multiplicity 1
50 atoms
O  0.47854 1.672018 0.909887
N  -2.802435 1.163723 -0.61134
N  0.932934 -0.123857 -0.506938
C  -2.775755 2.518227 -0.000587
C  -4.164739 0.775404 -1.047913
C  -3.72613 2.586718 1.212225
C  -5.15491 0.791045 0.134961
C  -5.164004 2.17915 0.815933
C  -1.782275 0.961467 -1.667998
C  -1.256357 -0.493027 -1.664511
C  -0.402565 -0.773289 -0.403087
C  -0.19492 -2.257184 -0.075742
C  0.152965 -2.625366 1.250821
C  -0.296161 -3.276109 -1.056418
C  1.302477 1.008252 0.198434
C  0.392534 -3.973934 1.590271
C  -0.054266 -4.628968 -0.7211
C  2.745876 1.433374 0.062422
C  0.291429 -4.982844 0.602321
C  3.055819 2.791657 0.32795
C  3.793764 0.538226 -0.279634
C  4.38384 3.255148 0.227128
C  5.124728 1.001399 -0.374205
C  5.422386 2.361978 -0.12911
H  -1.739194 2.721793 0.320824
H  -3.075876 3.306189 -0.742666
H  -4.541215 1.468527 -1.849009
H  -4.123818 -0.237898 -1.490647
H  -3.346528 1.90035 1.993575
H  -3.711865 3.611528 1.631248
H  -4.844937 0.021124 0.867885
H  -6.167313 0.524977 -0.226867
H  -5.577179 2.929681 0.109546
H  -5.825474 2.172037 1.703338
H  -2.180356 1.212995 -2.682243
H  -0.938357 1.648605 -1.4752
H  -0.665155 -0.681294 -2.584356
H  -2.116489 -1.189214 -1.680056
H  -0.912742 -0.272656 0.442136
H  1.619766 -0.578633 -1.111927
H  0.23141 -1.844357 2.01725
H  -0.573635 -3.020423 -2.085093
H  0.65284 -4.239982 2.621021
H  -0.139758 -5.404807 -1.490636
H  0.475241 -6.031117 0.863459
H  2.238401 3.458392 0.621266
H  3.592896 -0.529498 -0.431974
H  4.61142 4.307675 0.428606
H  5.928411 0.301196 -0.627398
H  6.45523 2.720001 -0.204151
