program: Gaussian 09
title: 000045079
version: EM64L-G09RevD.01
frameworkgroup: C1[X(C7H12Cl3N)]
method: RPBEPBE
basis: SDD
operation: Freq
keyword: #p
keyword: freq=noraman
keyword: PBEPBE/SDD
title: #p freq=noraman PBEPBE/SDD
converged: YES YES NO NO
title: Mulliken charges:
elementType: Cl Cl Cl N C C C C C C C H H H H H H H H H H H H
charge: -0.076447 -0.077085 -0.077407 -0.093546 -0.317359 -0.329912 -0.462215 -0.568446 -0.559742 0.174429 -0.573719 0.231891 0.231158 0.231030 0.230861 0.242183 0.224534 0.286327 0.259732 0.260150 0.275438 0.254596 0.233550
chargesum: 0.00000
title: Mulliken charges with hydrogens summed into heavy atoms:
elementType: Cl Cl Cl N C C C C C C C
charge: -0.076447 -0.077085 -0.077407 -0.093546 0.145689 0.131979 0.004502 -0.022386 -0.024154 0.174429 -0.085573
polarizability: 1.44680187e+02 -6.20074705e+00 1.02011843e+02 -8.18039359e+00 1.56481178e+00 9.11533959e+01
1716.lowfreq: -15.2916 -10.8716 -3.0619 -0.0024 -0.0013 0.0016 30.6944 37.0937 45.6181
frequency: 30.5982 37.0834 45.5257 50.1128 68.0335 82.4032 106.8424 157.1453 196.5641 217.7962 257.0070 318.7788 360.7029 373.1384 416.7543 451.7712 551.7858 582.2942 657.0062 658.7309 690.5156 764.1094 771.0237 835.1529 904.8248 928.4194 959.5747 993.6142 1002.7845 1041.1548 1046.6845 1103.1532 1119.6017 1138.8979 1204.9208 1239.7029 1250.3254 1255.2029 1279.4185 1310.4388 1341.4832 1362.2025 1366.1222 1371.8959 1406.4415 1434.8168 1445.4574 1452.0102 1460.4858 1467.7942 1650.5840 2906.6425 2971.5328 2974.2974 3028.2074 3038.2856 3044.0549 3061.7100 3064.2141 3110.6062 3151.6669 3154.1135 3225.9437
redmass: 4.9542 7.4076 6.3388 9.7272 2.5579 2.4192 3.4530 5.6079 4.6205 7.5439 3.9962 5.5347 2.7785 2.7411 2.7622 3.1705 4.6983 4.4903 5.4404 5.5700 1.1120 1.1240 1.1482 3.6930 1.8930 1.3276 2.0901 1.4994 1.5308 3.7331 3.7800 1.6394 1.5092 1.8686 1.7383 1.2205 1.1530 1.6426 1.1753 1.2720 1.4543 1.3732 1.3573 1.3041 1.1624 1.0831 1.0875 1.0846 1.0858 1.0960 5.8974 1.0679 1.0613 1.0599 1.0921 1.1026 1.1017 1.0570 1.0566 1.0637 1.1122 1.1123 1.1140
irintensity: 0.8688 1.6412 0.2093 0.8127 0.5157 2.5328 0.2344 2.7924 5.2247 6.0214 0.6939 8.6440 1.1158 16.7482 2.9070 5.3112 20.9034 32.0097 46.5679 124.7735 4.0545 3.2472 12.2015 5.8139 3.8887 79.6722 10.0004 4.4473 14.3367 1.9230 1.6708 49.6234 61.5784 36.9272 23.4886 16.2395 10.0036 18.3619 3.6615 24.7325 25.7367 8.5718 11.9516 3.3153 12.0311 12.5269 9.6496 1.6739 7.1199 24.9511 45.9899 71.5704 27.9659 44.2592 6.7340 14.5310 26.1013 12.3017 19.8826 1.7783 11.3076 19.2565 2.5597
temp: 298.150 k
press: 1.00000 atm
elementType: 17 17 17 7 6 6 6 6 6 6 6 1 1 1 1 1 1 1 1 1 1 1 1
symmnumber: 1
zpe: 472226.8 jmol-1
zpe.correction: 0.179862 hartree
zpe.thermalcorrener: 0.193734 hartree
zpe.thermalcorrenthalpy: 0.194678 hartree
zpe.thermalcorrgfe: 0.135404 hartree
zpe.sumelectzpe: -1707.951739 hartree
zpe.sumelectthermal: -1707.937867 hartree
zpe.sumelectthermalent: -1707.936923 hartree
zpe.sumelectthermalfe: -1707.996196 hartree
dipole: -1.2828 2.1857 2.5927
dipole: 3.6257
quadrupole: -102.8460 -92.8831 -84.9782
quadrupole: -6.3187 -1.6504 2.0875
quadrupole: -9.2769 0.6860 8.5909 -6.3187 -1.6504 2.0875
hfenergy: -1708.1316003 hartree
pointgroup: C01 [X(C7H12Cl3N1)]
dipole: 0.85207 0.4818111 -1.0375791 debye
dipolederiv: -0.2333902 0.1798489 -0.0434895 0.1631386 -0.7734831 0.1346606 -0.016123 0.0494976 -0.2126645 -0.8136229 0.2201994 0.1265243 0.1756313 -0.2503118 -0.0427076 0.0444636 -0.0245334 -0.2109638 -0.2723343 0.0240482 0.097193 0.0610117 -0.1634004 -0.1773645 0.1081483 -0.2014362 -0.6260901 -0.9513531 0.1691443 0.0285255 0.0182853 -0.8367308 0.0767053 0.0876828 0.1249907 -0.5600167 0.1110475 -0.1252493 0.0546339 -0.1047715 0.5734512 0.0302309 0.1620245 -0.2673559 0.2756745 0.6165064 -0.1910876 0.0303536 -0.2366717 0.1517232 0.0037773 -0.2934135 0.1126493 0.2808582 0.5302985 0.4060372 -0.0804521 0.4477811 0.4110753 -0.1212439 -0.059167 -0.110387 0.2005595 0.2610041 -0.2310934 0.0084417 -0.2079472 0.8768212 -0.1218604 -0.0300716 0.0265584 0.0713689 0.9336746 -0.2514138 -0.1161114 -0.1878546 0.2453017 -0.0045125 0.0383505 -0.0437691 0.0821773 0.3861075 -0.1399523 -0.1998928 -0.2065994 -0.0435717 0.3286887 -0.2137264 0.3389772 0.8216335 -0.3836147 -0.0297295 0.1033709 0.0157281 -0.3436895 0.0496144 0.0870516 0.036629 -0.1637262 -0.0776696 0.0649643 0.1152297 0.0427261 0.0424939 0.023637 0.0911742 0.0239621 -0.0043274 -0.0318916 -0.111692 -0.1072835 -0.0666522 -0.0545326 -0.0467235 -0.0740192 -0.0131872 0.017074 -0.0294663 -0.065866 -0.0221116 -0.1046247 -0.0621817 -0.0736994 0.0147733 -0.0527482 0.0574735 0.0070441 0.0624363 -0.0107499 0.1021168 -0.047916 0.126314 -0.0051274 0.0937641 -0.0567762 -0.0168461 0.0788263 -0.0378941 0.038764 -0.0676996 0.023967 -0.0236796 -0.0084921 0.1035832 -0.0905299 -0.0925612 0.1125699 -0.0165288 0.0606793 -0.0752656 0.1188748 0.0035293 -0.169788 -0.0136639 -0.0050046 -0.0585483 -0.026839 -0.0244878 -0.0580459 -0.0530696 -0.0223973 0.0349449 -0.0605035 0.0310142 0.1015121 0.0474983 -0.008608 -0.017622 0.0660653 0.0126527 0.015045 -0.0095006 0.0452499 -0.0330476 0.036333 -0.0160452 0.1064033 0.0006801 0.073135 -0.0211451 -0.0184995 -0.055119 -0.0319661 -0.0256708 -0.0348619 -0.0441011 0.0088435 -0.0266522 0.0566694 0.0482389 -0.0117212 -0.0615642 0.0072366 0.2022618 -0.0479067 -0.0763714 -0.0481114 0.0506008 0.1089646 0.0287209 0.0247563 0.0279087 0.1637124 -0.0729454 0.0166364 -0.0772754 -0.0421646 unknown
polarizability: 138.2755289|-15.9131421|107.943908|-9.1072043|3.4407928|91.6259892 unknown
InChI: InChI=1S/C7H12Cl3N/c1-7(10)6-11(4-2-8)5-3-9/h1-6H2
charge 0 multiplicity 1
23 atoms
Cl 0.79058 -3.741087 0.647293
Cl -4.123426 1.326304 0.604048
Cl 1.242582 1.740601 1.523405
N  -0.417949 -0.008576 -0.737714
C  -0.007223 -1.41671 -0.720059
C  -1.842017 0.344314 -0.713458
C  0.569523 1.000999 -1.122894
C  0.24145 -1.924514 0.713953
C  -2.281062 0.869355 0.667349
C  1.735737 1.176012 -0.161888
C  3.044229 0.972669 -0.425184
H  0.925345 -1.539293 -1.304561
H  -0.77759 -2.052007 -1.200339
H  -2.445994 -0.547182 -0.967812
H  -2.071547 1.114368 -1.477709
H  0.047675 1.971537 -1.224119
H  1.021803 0.767138 -2.114859
H  1.053783 -1.380955 1.216108
H  -0.671429 -1.917642 1.328084
H  -2.187794 0.108484 1.456034
H  -1.752765 1.788984 0.957142
H  3.829132 1.142124 0.315977
H  3.348157 0.626178 -1.419595
