program: Gaussian 09
title: 000045062
version: EM64L-G09RevD.01
frameworkgroup: C1[X(C6H11FO2)]
method: RPBEPBE
basis: SDD
operation: Freq
keyword: #p
keyword: freq=noraman
keyword: PBEPBE/SDD
title: #p freq=noraman PBEPBE/SDD
converged: NO YES NO NO
title: Mulliken charges:
elementType: F O O C C C C C C H H H H H H H H H H H
charge: -0.252155 -0.265417 -0.246262 -0.385759 -0.489736 -0.213609 0.254132 -0.226959 -0.672165 0.216779 0.244400 0.235920 0.271377 0.209744 0.190956 0.227444 0.228991 0.211646 0.231305 0.229368
chargesum: 0.00000
title: Mulliken charges with hydrogens summed into heavy atoms:
elementType: F O O C C C C C C
charge: -0.252155 -0.265417 -0.246262 0.075419 0.017561 0.187091 0.254132 0.229476 0.000155
polarizability: 9.15008822e+01 3.53417328e+00 6.80424505e+01 1.52903498e+00 -1.79188054e+00 5.59693156e+01
1716.lowfreq: -23.5459 -6.2116 -0.0002 0.0008 0.0008 4.6268 18.4467 44.5137 64.1946
frequency: -15.6514 44.3766 64.0749 90.7713 133.3323 147.2653 225.9942 249.0235 257.6449 338.1508 419.8943 457.5872 550.3134 682.6190 758.9553 799.5078 812.9601 865.3590 880.9291 942.2148 1013.2654 1025.8379 1084.9664 1105.2002 1114.3255 1134.2927 1136.0328 1161.9817 1207.4794 1249.0231 1275.6223 1305.2109 1357.4191 1371.8996 1383.5407 1401.6834 1442.5598 1452.4906 1463.9644 1469.2822 1474.5858 1486.8093 1637.6182 2996.3132 2996.6580 3002.1317 3009.2202 3010.6695 3049.7989 3067.5449 3071.0781 3084.7471 3092.9655 3108.6193
redmass: 3.5465 4.0611 2.5400 3.8835 3.3322 1.9846 3.3666 1.3796 2.6113 3.9881 3.7578 3.0600 2.6414 4.6516 1.6246 1.0981 3.5058 3.4586 2.2005 2.7800 2.7454 2.4338 1.9702 2.5031 2.2046 2.5683 1.4850 1.2344 1.3366 1.1347 1.1760 1.4295 1.3752 1.2409 1.7051 1.2744 1.0797 1.0957 1.0401 1.0932 1.0593 1.0704 9.5807 1.0574 1.0410 1.0582 1.0584 1.0630 1.0951 1.1067 1.1034 1.1064 1.0985 1.1024
irintensity: 3.8283 1.4220 0.3894 2.4318 5.6653 10.3453 7.8534 1.5396 1.5768 4.9605 12.8026 10.4455 1.1436 3.1801 2.9554 4.4551 5.5327 37.8747 11.4666 23.2143 34.2876 56.2418 18.9472 47.6044 4.3672 251.7533 13.5162 3.0820 55.0590 0.0035 14.1304 84.5476 0.6465 8.4524 10.9755 17.7419 3.8842 44.4826 12.0252 3.7690 4.6355 13.9022 173.7326 1.2829 28.7143 30.5563 21.0311 32.0652 0.1105 8.6996 25.7234 49.1016 29.9306 45.0485
temp: 298.150 k
press: 1.00000 atm
elementType: 9 8 8 6 6 6 6 6 6 1 1 1 1 1 1 1 1 1 1 1
symmnumber: 1
zpe: 430451.1 jmol-1
zpe.correction: 0.163950 hartree
zpe.thermalcorrener: 0.173964 hartree
zpe.thermalcorrenthalpy: 0.174908 hartree
zpe.thermalcorrgfe: 0.127308 hartree
zpe.sumelectzpe: -484.795592 hartree
zpe.sumelectthermal: -484.785579 hartree
zpe.sumelectthermalent: -484.784635 hartree
zpe.sumelectthermalfe: -484.832234 hartree
dipole: -1.2571 -0.0010 1.7779
dipole: 2.1775
quadrupole: -46.4001 -61.1847 -52.3165
quadrupole: 6.6847 5.6822 0.2207
quadrupole: 6.9003 -7.8842 0.9840 6.6847 5.6822 0.2207
hfenergy: -484.9595423 hartree
pointgroup: C01 [X(C6H11F1O2)]
dipole: -0.4950848 0.0078524 -0.6990971 debye
dipolederiv: -0.4242041 -0.088721 -0.0394247 -0.1591019 -0.5458944 -0.190577 -0.103788 -0.2160033 -0.4567667 -1.6195439 0.3833019 0.0183763 0.4210043 -0.6350259 0.0472335 0.0106548 0.0518017 -0.2953421 -0.6817076 -0.0890791 0.0506585 0.2801195 -0.9207953 0.1213972 -0.0293632 0.1486107 -0.3312112 -0.0689002 -0.0754303 -0.0034845 -0.1154502 -0.000987 0.0035778 0.0488508 0.0316849 0.0827987 -0.2752338 -0.0814168 0.0627401 -0.2168478 -0.127114 0.0450767 0.0839972 0.0473369 0.1207373 0.4788225 0.093825 0.0606714 0.1447677 0.611914 0.1708461 0.0577431 0.1563078 0.5625724 1.6402376 -0.1688786 -0.0804002 -0.5842533 1.2670081 -0.200155 0.0111989 -0.2347906 0.2292465 0.8815217 -0.0933606 -0.0206637 0.0777185 0.2383967 0.0216955 -0.0627883 0.0342717 0.3498737 -0.0902619 0.0884469 -0.0089399 0.0723315 -0.0087136 0.0096274 -0.0048175 0.0085124 0.0592657 0.0694758 -0.0211284 -0.019307 0.0312937 -0.0279957 -0.1093203 0.0029383 -0.1163194 -0.0025317 0.0519687 -0.0068954 0.0046888 0.0374562 0.0595219 0.0724924 -0.002593 0.0892128 -0.072197 0.0407548 0.0046334 -0.0062419 0.0417597 0.0737766 0.0649437 -0.0135736 0.090623 -0.0640474 0.0890701 0.0008697 0.0082205 0.0481573 0.0203537 -0.0720683 0.0129899 -0.0858303 0.0486745 -0.1429474 0.0986225 -0.0019375 0.0977807 -0.0338788 -0.0392783 -0.058137 -0.0070599 0.0525701 0.0767411 -0.0040663 -0.0261284 -0.0475863 -0.0219101 0.0881476 0.0254163 0.0420671 -0.1562101 -0.0456988 0.0257976 0.0105393 -0.0676842 -0.0483848 -0.0924531 -0.0097348 -0.1084843 -0.0148835 -0.0442976 0.0340016 -0.0275511 -0.0415342 0.0407366 0.0728223 0.0325693 0.0751263 -0.1030742 -0.1536935 -0.048748 0.0339173 -0.0721586 0.0537184 0.0209703 0.0396537 0.0190179 0.1077056 0.1049759 -0.044457 -0.0447525 0.0152801 -0.0458442 -0.1049649 -0.0306306 -0.1172663 -0.004115 0.1129207 -0.0073169 0.0290194 0.0369472 0.0511177 0.0699864 -0.0105863 0.091181 -0.1130658 unknown
polarizability: 91.4693219|-3.6191119|68.098693|-1.5901926|-1.6889231|55.9446334 unknown
InChI: InChI=1S/C6H11FO2/c1-2-9-6(8)4-3-5-7/h2-5H2,1H3
charge 0 multiplicity 1
20 atoms
F  3.494297 1.141049 0.594556
O  -1.58305 0.445249 -0.115521
O  -0.649509 -1.65204 0.290742
C  2.017877 -0.660328 -0.14693
C  0.802161 0.275452 -0.27376
C  3.33476 0.065677 -0.398266
C  -0.509009 -0.440437 0.000918
C  -2.941626 -0.131597 0.134629
C  -3.94243 1.003323 -0.054221
H  1.932176 -1.495018 -0.869794
H  2.031442 -1.119658 0.857392
H  0.744251 0.725539 -1.284499
H  0.897477 1.12509 0.427501
H  4.204499 -0.603977 -0.274102
H  3.364427 0.553979 -1.390851
H  -3.101487 -0.963386 -0.575294
H  -2.957769 -0.547663 1.158284
H  -4.968126 0.630533 0.120978
H  -3.745547 1.824714 0.655495
H  -3.890413 1.408598 -1.079057
