program: Gaussian 09
title: 000045093
version: EM64L-G09RevD.01
frameworkgroup: C1[X(C23H29NO4)]
method: RPBEPBE
basis: SDD
operation: Freq
keyword: #p
keyword: freq=noraman
keyword: PBEPBE/SDD
title: #p freq=noraman PBEPBE/SDD
converged: NO YES NO NO
title: Mulliken charges:
elementType: O O O O N C C C C C C C C C C C C C C C C C C C C C C C H H H H H H H H H H H H H H H H H H H H H H H H H H H H H
charge: -0.266046 -0.239664 -0.447842 -0.318402 -0.087432 0.106602 -0.510067 -0.481410 -0.403767 -0.384597 0.430674 -0.369112 0.202621 -0.141928 -0.386940 -0.389408 -0.322951 -0.251174 -0.254242 -0.244730 -0.219820 -0.675587 0.396592 -0.345235 -0.389465 -0.221729 -0.197493 -0.256901 0.225094 0.221496 0.221446 0.220437 0.218013 0.205803 0.205224 0.203964 0.219661 0.217004 0.222889 0.241990 0.237925 0.236400 0.230909 0.226600 0.225363 0.229720 0.351812 0.227880 0.228659 0.228258 0.232597 0.212140 0.251770 0.245828 0.224372 0.227572 0.228626
chargesum: 0.00000
title: Mulliken charges with hydrogens summed into heavy atoms:
elementType: O O O O N C C C C C C C C C C C C C C C C C C C C C C C
charge: -0.266046 -0.239664 -0.096030 -0.318402 -0.087432 0.106602 -0.063477 -0.039527 0.020049 0.024592 0.430674 0.067553 0.202621 0.080961 -0.144950 -0.151483 0.144358 -0.024575 -0.028879 -0.015010 0.236720 -0.002592 0.396592 -0.093465 -0.143637 0.002643 0.030079 -0.028275
polarizability: 2.86146628e+02 -4.19413258e+01 2.55028698e+02 -1.25128585e+01 -6.24743302e+00 2.40593379e+02
1716.lowfreq: -13.2926 -2.5139 -0.0003 0.0004 0.0008 6.1333 10.5002 18.6573 23.5686
frequency: 9.4607 17.3470 23.5627 29.6731 35.4698 41.8702 60.2251 64.6163 64.9955 82.6683 105.0928 112.4735 128.2155 157.6489 160.4279 187.4189 204.1417 216.8614 232.6967 241.9407 249.0087 256.2220 279.5036 322.8247 339.0095 344.4796 371.2760 378.6492 388.5062 398.6328 404.6771 410.7513 435.5343 453.3953 470.2147 476.8037 493.3160 502.0766 510.6486 522.2755 581.9098 610.6198 617.0198 638.3667 673.3541 691.3022 696.1605 707.4571 747.1872 757.9313 764.5976 780.3970 800.4455 801.7357 808.0927 818.5991 823.1222 844.5078 851.0224 879.0112 889.4325 914.8723 917.0207 939.8237 947.8180 951.8718 961.8208 975.8693 982.7452 983.3355 991.5502 994.3379 996.2522 1005.6744 1021.4577 1023.2872 1026.1229 1028.5675 1054.7904 1070.4448 1083.6332 1085.4402 1097.6754 1106.7334 1111.5778 1123.0609 1130.1427 1135.7128 1158.2378 1167.9042 1169.1016 1173.7873 1174.9932 1179.5152 1193.4798 1202.4185 1214.9755 1216.1865 1230.1534 1243.9336 1249.2066 1282.0193 1290.0514 1296.8509 1313.3735 1320.2822 1325.4544 1333.4523 1345.1247 1350.2135 1352.0145 1355.4106 1370.8194 1376.4261 1380.6054 1389.0709 1393.9903 1399.7406 1433.4654 1444.2421 1455.7602 1458.1132 1463.1378 1466.5816 1471.7438 1473.6075 1474.7625 1482.3446 1483.5313 1486.4900 1487.3070 1589.2137 1593.7736 1606.1904 1611.9916 1617.0193 2862.2088 2875.5164 2920.5131 2981.2335 2995.5790 3007.2292 3009.9653 3016.5231 3028.0263 3033.9238 3036.3826 3051.9741 3055.7370 3068.6644 3077.1338 3085.7742 3092.0698 3107.3809 3123.3240 3129.0584 3131.9264 3137.4834 3147.2512 3155.2036 3156.5945 3164.0553 3167.5363 3173.1873 3529.9148
redmass: 5.4351 5.2280 4.2302 4.2286 3.7206 4.5910 4.7082 3.0476 6.3377 3.2997 3.5847 4.6690 4.1054 3.0075 2.9129 4.2126 3.3218 3.9776 4.5104 3.4484 3.5203 1.6430 2.9210 3.4628 3.0565 2.2940 4.0078 2.2985 2.7545 3.9543 2.7846 2.9275 1.8683 1.4311 3.6118 3.1558 3.8766 2.8764 4.1872 3.6582 2.7137 6.4401 6.3734 4.0559 3.9319 2.1162 4.3276 1.8366 3.7701 1.6218 3.7840 2.7580 1.1317 4.0451 1.9833 2.3322 1.2585 3.0669 1.2538 3.0313 1.4610 2.1858 1.5751 2.3742 3.5222 2.7645 1.3780 1.4060 1.3258 5.0706 4.4564 1.5545 2.0343 2.4656 1.9902 2.0568 2.0938 2.5786 2.3942 2.1467 1.5621 1.7496 2.2877 2.1356 2.2872 2.9816 2.7931 1.4674 2.0585 1.0839 2.3944 1.7749 1.4825 1.1678 1.1077 1.1234 1.5874 2.4604 1.5744 1.2874 1.1359 1.5319 1.5123 1.5168 1.3325 1.3503 1.3839 1.3557 1.3186 1.3471 1.3434 1.3594 1.3306 6.6602 1.4014 5.2643 1.4267 1.2654 2.2023 2.2527 1.1801 1.0939 1.0408 1.0875 1.1067 1.0778 1.2022 1.7333 1.2062 1.0692 1.6833 5.8557 6.4935 6.8146 6.2321 9.3179 1.0714 1.0695 1.0680 1.0551 1.0358 1.0665 1.0582 1.0667 1.0866 1.0879 1.0860 1.0939 1.1035 1.1066 1.0980 1.0988 1.0985 1.1026 1.0845 1.0847 1.0881 1.0889 1.0925 1.0927 1.0950 1.0955 1.0998 1.1004 1.0652
irintensity: 0.0058 0.1732 0.4225 0.4208 0.1334 0.1660 0.2692 0.1825 0.5225 0.8354 1.6956 1.4066 1.6199 4.8427 0.7718 3.9241 1.4375 2.4983 2.1474 0.8060 5.2352 2.6670 0.7419 4.9493 9.9036 2.2030 9.3426 2.7872 0.5072 9.8090 0.0176 0.0741 29.2192 164.0578 2.6051 2.1571 2.4087 11.5236 3.1311 8.3628 5.2426 1.0148 0.1453 3.3466 10.1542 32.1347 4.9995 62.0752 12.6876 94.2899 2.6795 14.5882 1.7357 15.4586 5.3609 4.5123 0.7637 14.1447 0.5107 4.3467 9.7977 21.7754 12.3610 24.0966 56.6214 26.0020 1.1398 0.5045 0.9459 1.6555 0.5168 2.4505 1.7702 88.8400 64.9753 20.9387 31.7744 16.5064 48.6932 100.6704 19.9793 14.5720 15.8187 9.4461 6.5659 54.2325 4.0398 4.7831 71.5736 8.5265 23.8494 103.3280 69.1564 41.4985 10.9169 4.4177 51.3737 230.4097 34.4408 1.9414 0.0928 9.8787 8.2782 12.7444 2.3008 2.1877 9.1816 0.0845 2.6596 5.3372 0.7786 1.8863 5.6340 0.1845 48.3204 7.0173 7.1962 23.9823 6.9779 4.0738 101.0499 12.4214 13.8168 8.2217 10.2848 11.3561 30.0789 48.1276 23.5055 11.9801 10.5238 1.7535 22.8189 58.5222 89.2431 108.0986 51.7466 95.6051 77.5653 22.1272 19.8173 10.7151 18.2571 16.5035 38.6137 11.7417 49.5406 43.9234 36.7130 7.1941 21.4960 31.4881 31.0062 41.9017 1.1881 2.7657 6.0762 10.8764 25.5255 30.4558 33.6277 23.9526 11.3951 4.9980 18.5730
temp: 298.150 k
press: 1.00000 atm
elementType: 8 8 8 8 7 6 6 6 6 6 6 6 6 6 6 6 6 6 6 6 6 6 6 6 6 6 6 6 1 1 1 1 1 1 1 1 1 1 1 1 1 1 1 1 1 1 1 1 1 1 1 1 1 1 1 1 1
symmnumber: 1
zpe: 1247094.7 jmol-1
zpe.correction: 0.474993 hartree
zpe.thermalcorrener: 0.502202 hartree
zpe.thermalcorrenthalpy: 0.503146 hartree
zpe.thermalcorrgfe: 0.413226 hartree
zpe.sumelectzpe: -1247.370561 hartree
zpe.sumelectthermal: -1247.343353 hartree
zpe.sumelectthermalent: -1247.342409 hartree
zpe.sumelectthermalfe: -1247.432329 hartree
dipole: 1.2242 2.7185 1.9359
dipole: 3.5548
quadrupole: -160.7776 -164.6768 -162.5667
quadrupole: -9.5179 3.0954 -2.8946
quadrupole: 1.8961 -2.0030 0.1070 -9.5179 3.0954 -2.8946
hfenergy: -1247.8455548 hartree
pointgroup: C01 [X(C23H29N1O4)]
dipole: -0.5532213 -1.0847291 0.6879735 debye
polarizability: 282.7785035|-43.184777|256.0452258|14.4548578|3.2573435|242.9449753 unknown
InChI: InChI=1S/C23H29NO4/c1-2-27-22(26)23(19-9-5-3-6-10-19)13-15-24(16-14-23)17-20(25)18-28-21-11-7-4-8-12-21/h3-12,20,25H,2,13-18H2,1H3
charge 0 multiplicity 1
57 atoms
O  -3.318643 -2.261056 -0.416939
O  -3.340715 -1.267657 -2.518072
O  3.498833 3.39283 -0.386516
O  4.132261 0.821544 0.42716
N  0.436528 1.170202 -0.187196
C  -2.240011 -0.088679 -0.618059
C  -1.168568 -0.658657 0.358494
C  -1.479125 0.719923 -1.71366
C  -0.232402 0.433699 0.916183
C  -0.565688 1.790466 -1.092822
C  -3.347947 0.758748 0.073367
C  1.462106 2.1331 0.281201
C  -3.001646 -1.241003 -1.311405
C  2.620866 2.267967 -0.739048
C  -4.253197 1.5074 -0.72621
C  -3.540957 0.76452 1.478236
C  3.427873 0.970431 -0.86595
C  -5.299096 2.253671 -0.142186
C  -4.585488 1.512351 2.066983
C  -5.468251 2.265299 1.261187
C  -4.145577 -3.382469 -0.963105
C  -4.368918 -4.362372 0.183665
C  4.971225 -0.291039 0.607752
C  5.164733 -1.304062 -0.363522
C  5.636888 -0.357627 1.857114
C  6.031207 -2.383299 -0.070513
C  6.496392 -1.439436 2.132492
C  6.699727 -2.460058 1.170861
H  -1.63819 -1.221339 1.18249
H  -0.547581 -1.38086 -0.20428
H  -0.859333 0.015433 -2.298306
H  -2.182194 1.18729 -2.422301
H  0.548234 -0.045556 1.535746
H  -0.802539 1.130222 1.579468
H  -1.184499 2.548997 -0.549411
H  -0.034313 2.325456 -1.901083
H  1.045479 3.150712 0.462259
H  1.883173 1.772239 1.238148
H  2.214369 2.527434 -1.732827
H  -4.157084 1.492471 -1.817291
H  -2.884211 0.178212 2.127356
H  2.740762 0.119346 -1.034594
H  4.172462 1.045771 -1.681885
H  -5.984051 2.82039 -0.783014
H  -4.70963 1.503594 3.155911
H  -6.277864 2.845503 1.717714
H  4.087556 3.078666 0.349353
H  -3.600044 -3.834973 -1.810955
H  -5.089197 -2.956025 -1.349104
H  -3.408918 -4.756589 0.558845
H  -4.897044 -3.87465 1.020659
H  -4.981434 -5.213519 -0.165899
H  4.655567 -1.264537 -1.330756
H  5.468632 0.438772 2.589096
H  6.180916 -3.166304 -0.822569
H  7.009329 -1.486003 3.09963
H  7.368737 -3.299189 1.387908
