program: Gaussian 09
title: 000045032
version: EM64L-G09RevD.01
frameworkgroup: C1[X(C14H12N4O)]
method: RPBEPBE
basis: SDD
operation: Freq
keyword: #p
keyword: freq=noraman
keyword: PBEPBE/SDD
title: #p freq=noraman PBEPBE/SDD
converged: YES YES NO NO
title: Mulliken charges:
elementType: O N N N N C C C C C C C C C C C C C C H H H H H H H H H H H H
charge: -0.317788 -0.462909 -0.410714 -0.104729 -0.683269 0.304491 0.043382 0.141284 -0.363949 -0.347511 0.272505 0.176657 -0.215432 -0.235601 -0.326549 -0.308342 0.507272 -0.419604 -0.435607 0.373737 0.235004 0.340307 0.245196 0.221066 0.222152 0.273971 0.197411 0.224640 0.223992 0.314005 0.314934
chargesum: 0.00000
title: Mulliken charges with hydrogens summed into heavy atoms:
elementType: O N N N N C C C C C C C C C C C C C C
charge: -0.317788 -0.089172 -0.070406 -0.104729 -0.054330 0.304491 0.043382 0.141284 -0.128945 -0.102316 0.272505 0.176657 0.005634 -0.013449 -0.052579 -0.110932 0.507272 -0.194964 -0.211616
polarizability: 4.10771277e+02 2.33540741e+00 1.75342076e+02 2.84054858e-01 -1.65639342e-01 7.11006742e+01
1716.lowfreq: -3.0698 -0.0011 -0.0010 -0.0009 4.3643 5.3330 7.1382 30.7580 65.9167
frequency: 6.5289 30.7551 65.9086 83.5608 116.3670 164.5931 171.5967 235.7954 256.7504 287.1314 318.1169 351.0001 374.3263 404.5944 415.5092 429.2198 436.2841 436.9029 483.7144 505.0357 536.9088 579.2840 610.2496 614.8383 634.2128 635.2109 672.7599 701.5197 713.7085 751.3249 754.8407 764.4097 800.5999 808.1348 817.1590 822.2240 844.6356 855.3049 855.8126 895.0807 932.5035 935.8262 971.6603 983.6976 989.5537 997.5093 1011.0457 1021.2918 1084.5692 1111.0046 1137.5104 1158.9165 1182.3345 1201.3154 1218.6763 1252.3756 1269.2999 1308.9670 1314.9262 1333.3681 1377.9785 1390.0066 1407.7844 1443.6747 1450.1875 1471.6702 1486.1736 1522.3486 1548.6743 1560.2211 1586.3264 1599.4128 1633.7024 1639.3148 1648.9939 3115.5116 3127.9410 3129.1408 3141.5333 3143.0506 3158.5578 3164.1547 3170.3416 3468.8386 3559.8810 3564.5221 3699.1423
redmass: 3.7674 6.0427 5.5526 5.8680 6.3359 6.1195 5.1566 5.9793 5.4213 5.2292 6.2420 4.7262 3.9957 2.2052 1.1337 1.2702 3.2832 4.2622 5.7642 2.7108 6.8154 3.6961 6.6919 6.6265 2.0660 2.4178 4.5471 4.3443 5.8550 1.3052 4.0053 3.7863 1.1572 1.3816 5.4317 4.5290 1.6821 7.1561 1.4850 5.7005 1.3829 1.4097 1.2982 5.7452 1.3499 2.8782 2.3147 1.4453 2.5821 1.6170 1.2430 1.1248 1.5304 1.1903 2.3222 2.4210 2.9429 1.8992 1.5275 2.3806 4.7292 4.8771 3.3167 3.8055 4.3463 3.4835 2.7168 3.4734 5.0603 5.0529 6.2552 6.5170 3.4781 6.1321 1.4363 1.0865 1.0896 1.0852 1.0962 1.0902 1.0959 1.0952 1.0993 1.0830 1.0454 1.0761 1.1040
irintensity: 0.0092 1.9198 2.1925 3.0254 1.5135 8.2684 8.1320 0.5524 3.8095 3.5739 8.4974 0.0208 6.1023 0.0758 0.0810 324.3054 4.5389 4.3706 6.9155 1.5656 16.0838 1.3671 25.6640 0.0815 40.4847 30.5633 14.5641 12.1961 5.1926 77.6024 14.9589 2.5764 182.2720 6.2791 1.8235 0.1833 56.4342 4.4376 0.4042 26.7974 5.9030 0.1889 0.0049 1.7724 0.3656 1.8834 16.7287 1.9408 41.3244 7.3766 43.1320 0.5650 112.3326 102.2907 12.9467 96.0084 228.4170 27.6298 23.2971 48.1064 194.8959 145.0023 41.3677 37.0797 1.6787 4.1079 94.7201 103.6988 93.4173 795.8823 55.6498 142.7414 152.3883 64.8976 349.8696 21.0036 22.7134 1.6260 19.4781 11.7923 26.9934 6.3624 30.9491 187.0956 151.9768 28.5215 25.0595
temp: 298.150 k
press: 1.00000 atm
elementType: 8 7 7 7 7 6 6 6 6 6 6 6 6 6 6 6 6 6 6 1 1 1 1 1 1 1 1 1 1 1 1
symmnumber: 1
zpe: 627246.0 jmol-1
zpe.correction: 0.238905 hartree
zpe.thermalcorrener: 0.254164 hartree
zpe.thermalcorrenthalpy: 0.255108 hartree
zpe.thermalcorrgfe: 0.194036 hartree
zpe.sumelectzpe: -833.656442 hartree
zpe.sumelectthermal: -833.641184 hartree
zpe.sumelectthermalent: -833.640239 hartree
zpe.sumelectthermalfe: -833.701311 hartree
dipole: -7.2589 -0.5588 -0.0047
dipole: 7.2804
quadrupole: -59.6708 -103.4358 -118.2316
quadrupole: 10.8879 0.2098 -0.2627
quadrupole: 34.1086 -9.6564 -24.4522 10.8879 0.2098 -0.2627
hfenergy: -833.8953474 hartree
pointgroup: C01 [X(C14H12N4O1)]
dipole: 2.8530072 0.2545069 -0.0008401 debye
polarizability: 410.6683863|5.2768693|174.9550701|-1.8267891|7.0335395|71.5905714 unknown
InChI: InChI=1S/C14H12N4O/c15-10-7-5-9(6-8-10)13(19)18-14-16-11-3-1-2-4-12(11)17-14/h1-8,16,18H,15H2
charge 0 multiplicity 1
31 atoms
O  0.652481 -1.744873 -0.115311
N  -1.877781 -0.85716 -0.046363
N  0.144977 0.521337 0.008989
N  -2.086955 1.428415 0.071524
N  6.699198 0.548954 -0.012375
C  -3.257807 -0.602184 -0.023657
C  -3.370752 0.833174 0.050406
C  -1.244922 0.379719 0.012102
C  -4.383716 -1.447765 -0.058815
C  -4.647823 1.436649 0.09071
C  2.507648 -0.181159 -0.033646
C  1.064023 -0.532624 -0.049427
C  -5.650502 -0.82323 -0.017878
C  -5.779679 0.594391 0.055838
C  3.440358 -1.250231 -0.141609
C  3.020692 1.141372 0.084998
C  5.331257 0.309782 -0.018789
C  4.821218 -1.01947 -0.135882
C  4.401727 1.388266 0.092837
H  -1.338172 -1.729298 -0.097311
H  -4.290718 -2.537206 -0.114822
H  0.457614 1.492174 0.048392
H  -4.742865 2.525213 0.147157
H  -6.554041 -1.442487 -0.043091
H  -6.781629 1.036643 0.085848
H  3.041374 -2.265874 -0.229869
H  2.356262 2.008993 0.181008
H  5.518197 -1.86163 -0.221835
H  4.77227 2.415835 0.187088
H  7.065531 1.493349 0.069265
H  7.362634 -0.216974 -0.089781
