program: Gaussian 09
title: 000044981
version: EM64L-G09RevD.01
frameworkgroup: C1[X(C8H15NO2)]
method: RPBEPBE
basis: SDD
operation: Freq
keyword: #p
keyword: freq=noraman
keyword: PBEPBE/SDD
title: #p freq=noraman PBEPBE/SDD
converged: YES YES NO NO
title: Mulliken charges:
elementType: O O N C C C C C C C C H H H H H H H H H H H H H H H
charge: -0.247438 -0.265239 -0.007015 -0.374611 -0.255554 -0.345339 0.103127 -0.686054 -0.698108 -0.266701 -0.113211 0.212589 0.202827 0.178185 0.229458 0.190628 0.197825 0.155386 0.210457 0.213696 0.217263 0.252457 0.205668 0.233944 0.220313 0.235449
chargesum: 0.00000
title: Mulliken charges with hydrogens summed into heavy atoms:
elementType: O O N C C C C C C C C
charge: -0.247438 -0.265239 -0.007015 0.040804 0.152089 0.043113 0.258513 -0.044638 -0.006040 0.189061 -0.113211
polarizability: 1.17818880e+02 -4.95215251e+00 1.07038704e+02 2.96891886e-01 2.96466041e+00 7.67280656e+01
1716.lowfreq: -13.1225 -0.0009 -0.0006 -0.0006 0.2974 5.4503 13.8849 27.0165 49.2345
frequency: 11.1989 26.8412 49.0934 63.0624 102.6951 105.8986 138.5037 160.3775 200.4660 223.2901 227.4312 261.7745 297.5152 356.0333 373.3678 400.7490 493.1295 514.1841 581.2750 740.2612 788.8550 805.8649 851.1194 905.4579 930.7619 935.5591 971.3451 984.1771 993.5154 1042.2693 1059.2312 1084.0671 1112.5316 1129.5144 1144.0498 1155.4307 1204.2225 1209.0893 1269.2643 1271.9483 1284.9391 1317.0672 1322.9249 1348.4291 1365.9046 1383.7818 1389.2206 1398.1580 1454.6723 1460.9203 1467.8344 1471.1643 1475.2699 1476.0400 1484.8450 1492.9503 2210.4835 2857.4560 2925.7199 2933.5867 2967.3278 2975.0530 2976.3381 2992.3386 3001.4775 3010.7925 3029.8998 3059.8871 3073.7139 3075.6227 3096.9922 3117.3956
redmass: 2.1855 4.5762 2.7915 2.4476 2.5556 2.7443 3.5204 3.5791 1.1496 2.8380 1.1611 3.8662 4.1599 4.0265 4.0128 3.4818 4.6162 3.1617 5.0820 1.0716 3.7106 1.1619 2.7611 1.7327 3.9854 1.2196 4.1146 4.6156 1.9418 3.3263 1.9328 2.2063 2.3442 2.7595 1.5297 2.4301 1.0697 1.3801 1.2787 1.1719 1.0809 1.1694 1.2748 1.5133 1.3481 1.2930 1.2205 1.3839 1.0610 1.0525 1.0540 1.0716 1.0655 1.0431 1.0716 1.0915 12.4783 1.0833 1.0571 1.0646 1.0588 1.0365 1.0997 1.0601 1.0361 1.0996 1.0958 1.1038 1.1013 1.0997 1.0994 1.1004
irintensity: 0.5434 3.9143 7.1942 2.3316 0.4215 0.5122 8.6550 8.1854 0.0117 0.7326 0.3694 3.3242 0.0301 0.1006 1.1215 3.4516 1.3105 4.3482 7.6267 9.9736 71.2126 6.2591 29.7072 14.1825 8.2453 0.3420 95.7549 98.4643 40.8929 27.0252 80.8164 13.2559 12.1259 113.9867 2.0403 51.9068 1.5432 2.1266 0.2155 2.3239 0.1654 38.5235 41.1135 10.6495 4.2601 11.5021 15.2174 26.5869 0.9046 16.0113 2.4166 0.3540 1.2999 12.7483 5.8442 15.0005 0.9694 82.6326 39.1942 56.6933 35.2433 34.4319 25.4751 38.6153 15.7593 8.6919 7.5205 16.3122 103.6502 55.1564 29.2019 15.6030
temp: 298.150 k
press: 1.00000 atm
elementType: 8 8 7 6 6 6 6 6 6 6 6 1 1 1 1 1 1 1 1 1 1 1 1 1 1 1
symmnumber: 1
zpe: 574647.9 jmol-1
zpe.correction: 0.218872 hartree
zpe.thermalcorrener: 0.232941 hartree
zpe.thermalcorrenthalpy: 0.233886 hartree
zpe.thermalcorrgfe: 0.174807 hartree
zpe.sumelectzpe: -518.103110 hartree
zpe.sumelectthermal: -518.089040 hartree
zpe.sumelectthermalent: -518.088096 hartree
zpe.sumelectthermalfe: -518.147175 hartree
dipole: -0.7666 3.1774 3.0685
dipole: 4.4832
quadrupole: -67.2453 -77.4589 -66.9283
quadrupole: 15.7302 5.1587 -0.7628
quadrupole: 3.2989 -6.9147 3.6159 15.7302 5.1587 -0.7628
hfenergy: -518.3219816 hartree
pointgroup: C01 [X(C8H15N1O2)]
dipole: -0.3973131 1.2957244 1.1288528 debye
dipolederiv: -1.386288 -0.21794 0.0360401 -0.3966136 -0.6481463 0.0136938 -0.023894 -0.0042195 -0.3813004 -0.9987955 0.3140332 0.0052243 0.4853237 -0.8073166 0.062974 0.0885576 -0.0475616 -0.389876 -0.2336289 0.0093041 -0.0016287 0.058744 -0.2174256 0.0119443 0.0183037 0.00224 -0.2150573 -0.0599706 -0.0904414 -0.0246117 -0.1065018 0.0570183 0.0467515 -0.0057359 0.0419003 0.1012651 0.6127788 0.1537595 -0.0851943 0.3986826 0.4473132 -0.0058391 -0.2091803 -0.0039014 0.3932605 0.0243603 -0.0302145 -0.0322277 0.0384596 0.1388524 0.0303711 -0.0865773 0.0122618 0.1500519 1.5663866 -0.0516026 -0.0258897 -0.433366 0.9900537 -0.0449891 -0.033836 0.1698626 0.5797591 -0.0394693 -0.0262051 -0.034571 -0.0668237 0.06277 0.0045527 -0.0052034 0.0159604 0.075096 -0.0996048 -0.0794302 0.0365944 -0.0418669 -0.2282958 0.0599211 0.0660019 0.0662253 -0.0098313 0.7864532 -0.1928655 0.0603949 -0.0504538 0.4117212 -0.0866018 0.2150344 -0.1932731 0.4780033 -0.0831495 -0.0321893 -0.0239526 -0.0349006 0.0021854 0.0234186 -0.0486988 0.0224403 -0.0391112 0.0625926 -0.0113137 0.0030049 0.0038705 0.0688964 -0.0120187 -0.0079081 0.0059974 -0.1543603 -0.0012983 0.0863857 0.0199516 0.0949606 -0.1109266 -0.0296995 0.0191502 -0.054357 0.0608826 -0.0018379 -0.034715 -0.0238636 -0.0752779 0.0047468 -0.0306957 0.0322632 0.0249055 -0.2196157 0.0171889 0.0619969 0.0173927 -0.0006732 -0.1211877 -0.0033422 0.045392 -0.0323206 0.0402394 0.0417887 -0.0166192 -0.021832 -0.0215413 0.0594845 -0.0247633 -0.0024793 0.0168246 -0.2117358 -0.0266803 0.1184952 0.0174258 0.0850493 -0.1289616 -0.0231658 0.0302241 -0.0477018 0.064497 -0.0826278 -0.0138698 -0.017423 0.0766582 -0.0474307 0.0797777 -0.041595 -0.035643 -0.2651526 0.0068293 0.0811311 0.0068258 0.1503755 -0.1025636 -0.0511454 0.0191444 -0.0639819 0.0702495 0.0660589 0.005263 0.0271052 0.0131363 0.0963433 -0.0108176 -0.0397371 -0.0256336 -0.1810802 -0.058391 -0.1208844 0.0310617 -0.1551357 -0.0722596 0.0692643 0.0516625 0.0796274 0.0620461 0.1154411 -0.000916 -0.024202 -0.0162809 0.0999328 -0.0292536 -0.0039153 0.0222809 -0.084317 -0.1573228 -0.0616238 -0.0555544 -0.0290474 0.0917197 0.0131668 -0.0693898 0.0079587 0.0722698 0.0476349 0.1088257 0.0491129 0.0954068 -0.0571301 -0.047866 0.0446275 -0.057018 0.0718228 0.026061 0.0621371 0.061812 0.0183089 0.0400705 -0.0199969 -0.0568531 0.0235767 -0.1391212 -0.1445097 -0.020501 -0.0009957 -0.0904931 -0.0294639 0.0043587 0.0046419 0.0535495 0.071116 unknown
polarizability: 118.3820097|-4.2356182|106.6987904|0.9828573|1.1903909|76.5048504 unknown
InChI: InChI=1S/C8H15NO2/c1-3-4-6-10-8(2)11-7-5-9/h8H,3-4,6-7H2,1-2H3
charge 0 multiplicity 1
26 atoms
O  -0.62696 1.273193 -0.250855
O  1.491321 0.254001 -0.336551
N  3.569369 -2.475698 -0.131979
C  -2.75681 0.102335 -0.220489
C  -1.328135 0.098149 0.32551
C  -3.589431 -1.083988 0.319915
C  0.716437 1.428077 0.191765
C  -5.025563 -1.102251 -0.246328
C  1.252758 2.741666 -0.368011
C  2.714061 -0.012457 0.421866
C  3.179351 -1.375449 0.110155
H  -2.713153 0.058668 -1.325641
H  -3.246314 1.059585 0.044382
H  -1.32184 0.183026 1.435708
H  -0.786525 -0.821746 0.035189
H  -3.630024 -1.03478 1.427437
H  -3.081005 -2.036619 0.067302
H  0.783249 1.379494 1.309682
H  -5.566613 -0.172864 0.013149
H  -5.014649 -1.187061 -1.349048
H  -5.605136 -1.954393 0.153103
H  1.17676 2.724802 -1.467444
H  2.309043 2.893135 -0.083457
H  0.660354 3.589204 0.01707
H  2.533656 0.058535 1.518781
H  3.5208 0.706337 0.162488
