program: Gaussian 09
title: 000045103
version: EM64L-G09RevD.01
frameworkgroup: C1[X(C21H21NO6)]
method: RPBEPBE
basis: SDD
operation: Freq
keyword: #p
keyword: freq=noraman
keyword: PBEPBE/SDD
title: #p freq=noraman PBEPBE/SDD
converged: YES YES NO NO
title: Mulliken charges:
elementType: O O O O O O N C C C C C C C C C C C C C C C C C C C C C H H H H H H H H H H H H H H H H H H H H H
charge: -0.270457 -0.277572 -0.285637 -0.283689 -0.390570 -0.255159 0.037406 0.254758 -0.008440 -0.677837 0.512262 0.564092 -0.544287 -0.588189 -0.462781 0.212988 0.204441 -0.050876 -0.610368 -0.393871 0.231816 -0.328955 0.169430 0.105716 -0.539764 -0.518641 -0.532543 -0.520944 0.216719 0.273036 0.268392 0.270094 0.282995 0.245485 0.255532 0.252508 0.237514 0.246644 0.228152 0.235249 0.259454 0.216575 0.209981 0.231796 0.246046 0.205831 0.256210 0.231335 0.378120
chargesum: 0.00000
title: Mulliken charges with hydrogens summed into heavy atoms:
elementType: O O O O O O N C C C C C C C C C C C C C C C C C C C C C
charge: -0.270457 -0.277572 -0.285637 -0.283689 -0.012450 -0.255159 0.037406 0.254758 -0.008440 -0.188082 0.512262 0.564092 -0.275894 -0.318095 -0.179786 0.212988 0.204441 -0.050876 -0.364883 -0.138339 0.231816 -0.076447 0.169430 0.105716 0.172547 0.192637 0.155280 0.172433
polarizability: 3.37448902e+02 5.18829673e+01 3.11722428e+02 -2.19643857e+01 4.95667498e+00 1.89366119e+02
1716.lowfreq: -3.3852 -0.8771 -0.0005 -0.0004 0.0007 4.7417 12.4348 17.9116 27.6087
frequency: 11.9643 17.7698 27.5733 42.1190 47.2060 56.7554 64.6057 87.4401 92.3861 100.3900 113.2180 116.8733 136.8205 153.7806 167.4003 170.9484 175.3883 189.8966 194.4620 214.9680 219.5329 254.4351 259.4304 276.5076 287.7111 294.5003 307.7970 325.5924 335.8288 374.5756 384.5276 400.2418 418.9131 446.2936 465.7357 481.7014 495.8662 521.6770 528.5624 538.7877 558.6272 575.1948 589.9566 593.3681 630.5700 640.2335 661.8953 682.5609 710.8440 714.8996 724.5850 734.1123 744.1689 758.1363 796.9103 822.1676 835.0820 850.0614 869.5576 885.9355 893.2342 903.2317 926.9202 949.8264 951.9288 959.6954 963.9705 979.6818 1000.5977 1036.4825 1048.1505 1109.2923 1110.0653 1110.6654 1112.0454 1114.6925 1127.5513 1139.5423 1146.2224 1154.3806 1155.3067 1158.3870 1165.7941 1187.1084 1207.9514 1211.4083 1256.4526 1258.8006 1269.8763 1271.6366 1292.9691 1309.8111 1336.2491 1375.9985 1378.8340 1389.6931 1405.7724 1412.1683 1426.8357 1427.5001 1435.3231 1444.2078 1446.1762 1455.3033 1456.4440 1458.7154 1465.2529 1467.1795 1471.1056 1473.5190 1479.7008 1481.5540 1499.0141 1503.3690 1549.6510 1570.1291 1583.0513 1609.2271 1613.4050 1628.2725 2956.9948 2968.1283 2970.3107 2980.6104 2983.1839 3045.1805 3046.0302 3060.8353 3079.0352 3094.4325 3122.8680 3124.5521 3131.2971 3132.4198 3135.7628 3141.8870 3159.7300 3161.5049 3166.3907 3177.2795 3508.9095
redmass: 4.4278 5.4641 4.6960 5.1041 5.9029 3.2886 2.5747 2.5422 3.2475 2.7685 3.8069 5.6681 3.0110 1.8697 2.1546 1.9862 3.0544 3.0311 4.1016 4.4735 2.5291 2.4128 1.2985 2.3536 5.7685 4.7753 3.5840 4.3610 4.0582 4.5378 3.9425 5.5158 5.6738 4.7413 3.5105 3.7682 5.8416 4.7224 4.5311 4.4116 3.3436 5.2561 4.3873 4.1648 4.5159 1.8239 6.2629 5.2380 5.5922 5.3264 5.2560 3.8924 3.1353 5.0708 2.4213 4.1431 1.4960 1.5819 2.1125 1.5893 4.3449 4.5887 5.5265 1.7414 1.6997 3.9360 2.8309 6.4414 4.6275 3.7374 2.8562 1.3006 1.3260 1.9036 1.2391 1.2628 2.2815 1.7434 1.5450 1.4315 1.3812 1.6042 1.6793 1.3152 1.9006 1.8918 2.3459 3.0236 1.8532 1.5175 1.6280 4.0802 4.2478 6.0651 4.2337 3.5735 2.2292 2.9321 2.0488 1.2644 2.1614 1.3396 1.5071 1.1085 1.0740 1.0888 1.0526 1.0499 1.1089 1.1106 1.0550 1.0567 2.6126 3.4121 8.0177 6.7707 7.4721 6.3515 7.8035 7.3999 1.0337 1.0323 1.0355 1.0620 1.0343 1.0975 1.1029 1.1045 1.0963 1.0977 1.0990 1.1043 1.1001 1.0907 1.1050 1.0886 1.0927 1.0924 1.0961 1.0899 1.0638
irintensity: 0.6940 0.2378 0.7677 1.6585 1.2779 3.0471 6.1294 0.1732 11.0056 1.8576 4.5930 0.1685 0.2413 1.2495 5.3242 1.3124 4.0981 5.3841 2.0137 2.6886 1.5649 2.7569 0.1924 3.3567 3.0940 6.4320 0.9596 4.9962 6.1763 0.6565 3.8217 1.7476 6.0439 7.6855 4.5681 3.6186 43.2156 10.9332 3.2787 8.9855 17.4758 15.9172 5.5838 37.6541 18.6635 106.9536 13.0513 15.5774 4.7104 16.7903 20.0186 3.8818 0.3554 18.7816 14.1506 5.3554 34.7764 19.3106 33.9245 6.1178 2.3013 38.8713 41.2448 30.7992 15.5743 59.1808 2.3425 37.4598 67.7565 29.6164 266.1773 6.2867 16.6252 65.2374 13.6491 1.1391 56.9875 198.9033 18.0768 9.7027 7.5630 24.4766 57.5743 17.0941 45.6466 98.0956 278.3410 112.8237 90.9842 13.3456 1.0467 49.2179 14.1820 9.0045 7.7064 83.7326 16.3177 54.2850 25.4941 3.6144 3.0155 11.1120 13.2651 12.8817 11.6711 14.9685 14.6265 18.7829 32.5567 146.1709 24.8879 32.9011 111.7039 231.4936 28.2660 14.1333 16.4446 22.3199 292.3226 33.1873 59.2292 45.8042 79.6041 21.9571 86.6940 2.5863 47.5160 33.2633 42.6736 35.4882 24.9776 20.0287 21.1959 9.1291 15.5226 6.2474 1.5539 1.4264 4.7894 4.7894 44.7267
temp: 298.150 k
press: 1.00000 atm
elementType: 8 8 8 8 8 8 7 6 6 6 6 6 6 6 6 6 6 6 6 6 6 6 6 6 6 6 6 6 1 1 1 1 1 1 1 1 1 1 1 1 1 1 1 1 1 1 1 1 1
symmnumber: 1
zpe: 993221.8 jmol-1
zpe.correction: 0.378298 hartree
zpe.thermalcorrener: 0.405689 hartree
zpe.thermalcorrenthalpy: 0.406634 hartree
zpe.thermalcorrgfe: 0.317812 hartree
zpe.sumelectzpe: -1316.848091 hartree
zpe.sumelectthermal: -1316.820700 hartree
zpe.sumelectthermalent: -1316.819755 hartree
zpe.sumelectthermalfe: -1316.908577 hartree
dipole: 5.4251 5.0034 -2.1160
dipole: 7.6775
quadrupole: -170.5321 -158.6816 -152.6450
quadrupole: 13.1303 -13.5927 6.7223
quadrupole: -9.9125 1.9380 7.9746 13.1303 -13.5927 6.7223
hfenergy: -1317.2263888 hartree
pointgroup: C01 [X(C21H21N1O6)]
dipole: 1.3895391 2.6695418 -0.257925 debye
polarizability: 303.073954|53.2569285|338.9383244|-12.2193123|31.4123776|196.5251714 unknown
InChI: InChI=1S/C21H21NO6/c1-25-17-6-5-12(8-18(17)26-2)7-15-14-11-20(28-4)19(27-3)10-13(14)9-16(22-15)21(23)24/h5-6,8-11,23H,7H2,1-4H3
charge 0 multiplicity 1
49 atoms
O  -1.080297 3.557435 0.215036
O  -3.703627 3.129162 1.198633
O  4.850342 1.174279 -0.563078
O  4.883392 -0.133993 1.972224
O  -2.548944 -4.976723 -1.229943
O  -4.502219 -4.246479 -0.217438
N  -1.436464 -2.486478 -1.123428
C  -1.520623 -0.117672 -0.491221
C  -0.860493 -1.268209 -1.075774
C  0.527039 -1.169243 -1.698251
C  -2.856395 -0.293543 0.035221
C  1.659195 -0.848695 -0.719666
C  -0.917002 1.174504 -0.421994
C  -3.529811 0.824543 0.618256
C  -3.443708 -1.591768 -0.035832
C  -1.59622 2.258951 0.145292
C  -2.930064 2.081395 0.689661
C  -2.711303 -2.641469 -0.604834
C  2.687131 0.054579 -1.092121
C  1.731295 -1.475564 0.545656
C  3.773152 0.330412 -0.227183
C  2.79698 -1.184527 1.42295
C  3.821297 -0.283052 1.062934
C  -3.3486 -3.991272 -0.652852
C  0.24931 3.791193 -0.36277
C  -3.123544 4.004896 2.242012
C  4.909376 1.684885 -1.934078
C  5.304376 1.235404 2.329186
H  0.519042 -0.413306 -2.508857
H  0.712139 -2.149914 -2.173412
H  0.097183 1.301816 -0.806231
H  -4.539921 0.713049 1.024708
H  -4.450619 -1.785071 0.34628
H  2.648531 0.519566 -2.083965
H  0.95602 -2.188706 0.844481
H  2.86869 -1.658643 2.406954
H  1.019836 3.183641 0.148784
H  0.445513 4.861194 -0.203018
H  0.251669 3.565557 -1.446175
H  -3.936316 4.698651 2.503494
H  -2.249117 4.55277 1.858375
H  -2.841418 3.405348 3.128425
H  4.06057 2.362807 -2.153761
H  4.921815 0.857168 -2.668827
H  5.853377 2.246742 -1.990958
H  4.456931 1.798053 2.768315
H  5.698692 1.771793 1.450936
H  6.091458 1.099164 3.086565
H  -3.059945 -5.831831 -1.213112
