program: Gaussian 09
title: 000044977
version: EM64L-G09RevD.01
frameworkgroup: C1[X(C5H8ClFN2O3)]
method: RPBEPBE
basis: SDD
operation: Freq
keyword: #p
keyword: freq=noraman
keyword: PBEPBE/SDD
title: #p freq=noraman PBEPBE/SDD
converged: YES YES NO NO
title: Mulliken charges:
elementType: Cl F O O O N N C C C C C H H H H H H H H
charge: -0.039784 -0.231406 -0.247776 -0.245692 -0.205368 -0.195563 0.119285 -0.335654 -0.567640 -0.293338 0.364546 -0.180766 0.272300 0.272744 0.277957 0.298675 0.230786 0.270438 0.207405 0.228852
chargesum: 0.00000
title: Mulliken charges with hydrogens summed into heavy atoms:
elementType: Cl F O O O N N C C C C C
charge: -0.039784 -0.231406 -0.247776 -0.245692 -0.205368 -0.195563 0.119285 0.209390 0.008992 0.207886 0.364546 0.255491
polarizability: 1.21164399e+02 9.14699709e-01 9.14314314e+01 -2.37821129e+00 1.20546335e+01 6.36872121e+01
1716.lowfreq: -6.9887 -0.0010 -0.0001 0.0014 2.2871 5.7378 18.9085 40.4222 42.8416
frequency: 18.7803 40.3797 42.8309 54.3757 70.8681 120.1888 129.8682 185.0899 221.0717 223.6937 293.1450 316.2313 348.6223 385.6872 435.8399 469.6091 505.2923 687.6362 704.2053 706.0987 765.3398 788.2052 838.5374 849.6748 905.0186 995.3733 1026.5280 1038.1261 1054.2222 1080.4594 1110.9910 1199.3492 1205.5379 1254.6226 1267.1328 1280.6712 1326.4964 1357.3346 1371.4105 1377.4438 1389.0383 1442.6793 1446.1775 1447.7239 1458.3037 1630.4619 3018.2647 3033.8322 3044.8131 3071.4697 3095.3755 3109.2615 3115.6748 3160.9434
redmass: 8.5397 9.2441 6.2071 11.2184 2.7344 5.1651 4.5164 6.4867 10.4348 9.3229 4.9778 2.7480 3.0598 6.6198 9.3836 4.1327 4.1839 8.9715 6.3488 3.9503 2.7105 2.1318 3.2768 3.1567 3.1612 2.4910 2.6465 1.8251 3.2491 3.8272 2.7144 1.2654 1.3782 1.1293 1.1943 2.2025 1.3974 1.2807 1.5291 1.3996 5.4738 1.1101 1.1008 1.0924 1.0941 9.7376 1.0567 1.0589 1.0589 1.0560 1.1088 1.1076 1.1052 1.1129
irintensity: 2.0491 1.3834 0.5038 0.2657 0.7495 5.0836 11.5339 5.3921 1.3934 0.6060 16.9856 17.2938 16.7409 10.2102 19.4041 6.4902 22.3988 30.7847 46.3435 26.9066 18.5944 119.2059 23.0579 27.9149 125.4295 6.6198 46.0908 45.4409 2.4373 235.8786 80.7832 24.8847 21.4083 4.7240 38.9450 203.9267 83.0219 10.0287 110.4450 27.6764 120.2444 44.3579 17.5671 5.9131 13.6166 183.1367 20.9703 43.1110 2.5778 11.7839 19.1501 7.6125 1.5053 2.4454
temp: 298.150 k
press: 1.00000 atm
elementType: 17 9 8 8 8 7 7 6 6 6 6 6 1 1 1 1 1 1 1 1
symmnumber: 1
zpe: 367947.4 jmol-1
zpe.correction: 0.140144 hartree
zpe.thermalcorrener: 0.153495 hartree
zpe.thermalcorrenthalpy: 0.154439 hartree
zpe.thermalcorrgfe: 0.096536 hartree
zpe.sumelectzpe: -1089.388507 hartree
zpe.sumelectthermal: -1089.375156 hartree
zpe.sumelectthermalent: -1089.374212 hartree
zpe.sumelectthermalfe: -1089.432115 hartree
dipole: 4.1803 0.3028 -1.6096
dipole: 4.4897
quadrupole: -65.3947 -88.8735 -76.2755
quadrupole: 0.0398 -3.7993 -2.0622
quadrupole: 11.4532 -12.0256 0.5724 0.0398 -3.7993 -2.0622
hfenergy: -1089.5286509 hartree
pointgroup: C01 [X(C5H8Cl1F1N2O3)]
dipole: 1.5772142 -0.3297113 -0.7237319 debye
dipolederiv: -0.5555864 -0.1419233 0.1562241 -0.1232236 -0.1951193 0.0434017 0.1073917 0.0377602 -0.2318565 -0.3554283 -0.0086384 0.1308098 -0.0323479 -0.2678145 0.0247457 0.0135832 -0.0116278 -0.6710776 -1.83805 0.0659394 0.0492971 -0.1784633 -0.3650939 0.0335272 0.2113808 0.0116613 -0.3165029 -0.735182 0.0626601 0.0328051 -0.0454898 -0.951 0.1375691 0.1006576 0.1576567 -0.3602661 -0.4502329 0.8528529 -0.225651 0.1541756 -0.8404394 0.1905072 0.0218218 0.0601497 -0.173576 -0.7062845 0.1134578 0.0659509 0.7009369 -1.2956615 0.234842 0.0374179 0.3023263 -0.2926529 0.0821364 -0.4773086 0.1580758 -0.4007601 1.6572172 -0.415139 0.0311496 -0.3355249 0.0820123 0.2550756 0.0520161 -0.0417739 0.0348957 -0.0007268 0.0568854 -0.1305429 0.070009 0.1714164 0.6744431 0.1660262 -0.1830677 0.1496074 0.2097181 -0.048556 -0.1912458 -0.0984717 0.2155755 0.8469272 -0.1462066 -0.007239 -0.3945622 0.1742144 -0.0477982 0.0959589 -0.0056834 0.1961256 2.381421 -0.5407658 -0.0899537 -0.0913907 1.377254 -0.206671 -0.3022421 -0.2285708 0.404784 0.3500875 0.0134641 -0.1201273 0.0436568 0.3453464 -0.0462794 -0.0747838 -0.0333435 0.6968751 0.0380117 -0.0050395 -0.0143606 0.0905115 0.0722186 0.0570516 -0.0097742 0.0307009 0.0561813 0.0883225 -0.0197176 0.0369955 -0.0347676 0.0135079 -0.0717763 0.0504273 -0.0378732 0.0521127 -0.0050213 -0.0577307 0.0099207 -0.0384893 -0.0439624 -0.0786295 0.0256401 -0.0176486 0.0409727 -0.0472836 0.025845 -0.0465435 0.009791 0.0393099 0.063342 -0.0116318 0.0295221 0.0505319 -0.0576443 0.0300754 0.0446676 0.0394721 0.1153648 0.0240139 0.0804638 -0.0136308 -0.0585851 0.0624538 -0.0655527 -0.0141023 0.0719924 -0.0107185 0.01746 -0.0412826 0.0398631 0.0958383 -0.1393751 0.0688639 0.0302875 0.0990971 0.0581474 -0.0006456 -0.0408907 0.0156812 0.0273824 0.1112096 0.0116822 0.027785 -0.0546421 -0.0917626 0.0321492 0.0265012 0.027044 0.0147092 unknown
polarizability: 120.087103|-2.2706308|92.2741|-8.1641126|-10.8432539|63.9218394 unknown
InChI: InChI=1S/C5H8ClFN2O3/c6-1-3-9(8-11)5(10)12-4-2-7/h1-4H2
charge 0 multiplicity 1
20 atoms
Cl -4.260449 -0.833876 1.307242
F  2.913427 -0.376173 1.711954
O  1.498445 -0.043478 -0.892703
O  0.140425 -1.816436 -0.159527
O  -1.536545 2.371327 -1.036105
N  -0.788732 0.27242 -0.654422
N  -0.498691 1.646537 -0.987704
C  -2.168567 -0.212532 -0.409793
C  -2.485408 -0.242871 1.094492
C  2.727634 -0.851978 -0.663726
C  0.301392 -0.632555 -0.53216
C  3.559236 -0.182712 0.416742
H  -2.851178 0.482107 -0.928279
H  -2.264765 -1.222938 -0.836564
H  -2.439895 0.754699 1.554127
H  -1.857334 -0.965527 1.633482
H  3.268778 -0.846595 -1.625498
H  2.447508 -1.881905 -0.383229
H  4.561699 -0.646618 0.472646
H  3.638721 0.905502 0.250323
