program: Gaussian 09
title: 000045000
version: EM64L-G09RevD.01
frameworkgroup: C1[X(C16H36N6)]
method: RPBEPBE
basis: SDD
operation: Freq
keyword: #pfreq=noraman
keyword: PBEPBE/SDD
title: #p freq=noraman PBEPBE/SDD
converged: YES YES NO NO
title: Mulliken charges:
elementType: N N N N N N C C C C C C C C C C C C C C C C H H H H H H H H H H H H H H H H H H H H H H H H H H H H H H H H H H H H
charge: -0.109083 -0.107915 -0.657253 -0.635215 -0.658928 -0.634392 -0.384986 -0.386874 -0.385341 -0.383637 -0.386123 -0.388129 -0.374514 -0.374932 -0.370045 -0.367667 -0.391873 -0.394292 -0.458005 -0.459005 0.207216 0.205740 0.193820 0.190441 0.194356 0.190624 0.193700 0.189883 0.193663 0.189218 0.194667 0.188844 0.188813 0.195980 0.181995 0.192146 0.191943 0.180442 0.227096 0.173719 0.172302 0.232757 0.179893 0.205968 0.203517 0.179765 0.179081 0.207206 0.198448 0.190537 0.333573 0.307022 0.316635 0.289585 0.334587 0.307445 0.316270 0.289314
chargesum: 0.00000
title: Mulliken charges with hydrogens summed into heavy atoms:
elementType: N N N N N N C C C C C C C C C C C C C C C C
charge: -0.109083 -0.107915 -0.016659 -0.028995 -0.016896 -0.028808 -0.000725 -0.001894 -0.001757 -0.000756 -0.002613 -0.003336 -0.000373 -0.002547 0.030770 0.037392 -0.006011 -0.011010 -0.071718 -0.070021 0.207216 0.205740
polarizability: 2.98968206e+02 -4.22647790e+00 1.93687182e+02 2.27873424e+01 1.56080017e+00 1.85452365e+02
1716.lowfreq: -16.4213 -5.0129 -0.0017 -0.0012 0.0010 1.4573 4.1563 14.3793 16.2202
frequency: -6.2855 11.9424 15.8974 22.6427 26.2626 33.0221 36.9188 39.2458 65.1783 66.4163 73.4315 94.5432 101.7821 121.1106 125.9109 127.7413 133.1127 145.9347 149.7702 170.4623 183.0543 201.6309 210.2947 247.6529 266.3968 293.0016 298.4434 351.3262 364.8891 380.1483 388.0508 400.9174 406.2783 427.0250 429.9334 449.0346 450.9356 470.5829 479.4814 508.0501 512.9705 557.9369 559.0888 575.0215 575.7645 676.4053 677.1930 717.6154 719.3499 724.2613 732.9046 747.2520 769.7561 799.4477 832.2573 858.0203 873.4027 882.7572 899.6014 932.3950 958.4430 967.3366 983.2524 986.1842 993.1249 1009.4564 1022.3635 1028.5605 1033.9363 1034.1602 1037.5705 1052.1513 1070.1227 1070.6928 1078.6108 1080.8718 1083.2781 1086.5573 1107.0687 1132.0018 1133.3535 1178.6972 1180.3079 1184.6844 1189.7348 1201.0781 1214.4497 1221.8970 1239.3412 1241.8548 1261.0536 1261.7928 1273.2789 1278.0067 1279.4677 1280.3090 1284.8459 1290.3669 1291.1427 1293.4538 1300.8291 1321.0518 1338.4510 1346.2841 1347.4318 1349.1864 1350.6640 1352.6198 1361.0080 1361.2631 1404.2643 1404.8126 1450.2766 1451.4626 1455.7125 1456.4409 1457.8509 1458.0540 1460.9387 1461.8878 1464.2727 1469.1271 1475.2850 1481.0063 1485.0929 1487.3311 1599.0867 1600.3407 1615.5528 1615.8821 1671.0286 1671.5461 2857.5511 2866.4549 2910.2531 2919.4199 2943.8312 2945.1654 2946.4386 2946.8988 2948.5464 2949.9320 2952.3032 2954.6875 2958.3603 2962.4786 2969.3240 2971.1115 2979.1255 2981.4236 2985.3965 2991.4268 3000.8754 3012.0748 3019.1387 3022.5546 3029.3262 3038.3030 3047.5076 3049.3506 3517.6869 3517.9456 3546.8013 3548.7242 3666.1405 3666.3646 3692.7981 3694.2593
redmass: 3.6546 3.5975 4.2543 3.4906 3.4621 3.4828 2.4780 4.1191 2.5892 3.0055 2.3932 3.4348 1.6822 3.0651 3.6364 2.0569 2.8965 1.9262 2.2507 3.0806 3.4622 3.4815 3.3865 2.5923 2.1301 2.5060 3.1457 1.9918 1.3410 1.4445 1.7413 1.4597 1.3444 1.1877 1.1868 2.1829 1.9822 2.5256 2.5627 2.9089 2.7389 2.0324 1.9543 1.6859 1.7138 4.7325 4.7803 1.0587 1.0667 1.0855 1.1302 1.2132 1.3373 1.4982 1.7759 2.1623 1.8544 1.9888 1.6505 1.6937 2.2249 2.4430 3.5477 3.4083 1.5303 3.1721 1.2383 3.4560 1.4408 1.4272 2.0707 2.5953 2.7036 2.4520 1.9778 2.1534 2.0924 2.2209 3.7176 1.6720 1.6421 1.7766 2.0368 1.4806 1.6046 1.3304 1.4621 1.3208 1.3731 1.2918 1.2648 1.3038 1.0141 1.0450 1.2370 1.2331 1.0558 1.1347 1.1236 1.1273 1.2880 1.3591 1.4430 1.4623 1.4663 1.6128 1.6301 1.6671 1.5516 1.5554 4.3474 4.3316 1.0833 1.0840 1.0885 1.0891 1.0753 1.0712 1.0663 1.0688 1.0755 1.0923 1.0974 1.0997 1.1003 1.1006 1.2225 1.2261 1.2774 1.2716 3.6092 3.6215 1.0609 1.0548 1.1013 1.0941 1.0589 1.0587 1.0584 1.0594 1.0589 1.0613 1.0636 1.0634 1.0610 1.0591 1.0624 1.0629 1.0953 1.0956 1.0968 1.0989 1.1007 1.1000 1.0970 1.0997 1.1045 1.1046 1.1032 1.1027 1.0450 1.0450 1.0454 1.0453 1.1014 1.1014 1.1024 1.1028
irintensity: 1.0502 0.8223 0.9017 0.5222 0.3133 6.5114 0.1114 2.0040 0.4227 0.0869 0.3268 0.4986 0.0402 0.4323 0.2082 0.2742 0.7563 0.1382 0.1210 3.5345 3.9427 4.4008 3.0354 3.6873 7.5425 2.3977 0.4207 88.0275 10.9320 59.2561 69.3874 123.7829 127.8614 199.5932 150.8602 12.2584 36.9572 9.5603 8.8771 2.5545 3.0596 143.3775 114.5807 181.0297 48.5833 86.1507 90.0994 18.0348 1.0520 5.6376 0.6285 1.6878 1.7657 2.3548 0.5549 6.4083 1.3104 0.3859 2.9509 1.9599 19.1204 1.8626 2.7571 0.7635 4.2438 3.0403 3.4746 0.8422 7.9186 10.3254 1.3118 1.4912 1.2393 1.7559 0.1925 0.5121 1.4947 2.6470 0.9986 6.1594 0.7096 16.4205 0.5594 25.2454 17.1277 0.6237 0.7101 0.2050 7.1551 0.0937 0.2127 0.6070 0.7771 0.3752 1.7762 0.6699 2.1277 0.0282 0.1898 0.2018 0.9983 0.2764 0.5472 39.5007 36.3922 2.4746 1.7339 4.2792 16.8600 17.6575 119.1367 130.6387 8.9680 6.3888 26.1963 22.9824 0.1105 0.2830 0.3416 0.0263 0.0091 0.6536 0.0329 2.3529 0.2243 39.3244 125.9471 129.2682 86.8819 84.9124 847.2029 261.3707 79.4940 80.7743 59.2705 59.5254 4.2734 1.6374 3.4765 0.8696 0.1439 0.2383 8.3831 18.2220 2.3555 251.2423 102.4493 104.4948 5.8962 1.2525 9.0543 3.8165 5.2128 13.1300 13.2515 5.8745 0.9086 95.4074 130.3497 226.8850 15.9786 16.4603 15.1842 16.7632 18.3613 17.9092 18.2528 18.7923
temp: 298.150 k
press: 1.00000 atm
elementType: 7 7 7 7 7 7 6 6 6 6 6 6 6 6 6 6 6 6 6 6 6 6 1 1 1 1 1 1 1 1 1 1 1 1 1 1 1 1 1 1 1 1 1 1 1 1 1 1 1 1 1 1 1 1 1 1 1 1
symmnumber: 1
zpe: 1360888.2 jmol-1
zpe.correction: 0.518335 hartree
zpe.thermalcorrener: 0.546471 hartree
zpe.thermalcorrenthalpy: 0.547415 hartree
zpe.thermalcorrgfe: 0.454095 hartree
zpe.sumelectzpe: -957.994752 hartree
zpe.sumelectthermal: -957.966616 hartree
zpe.sumelectthermalent: -957.965672 hartree
zpe.sumelectthermalfe: -958.058993 hartree
dipole: 0.2999 -0.5900 -0.7853
dipole: 1.0271
quadrupole: -29.8371 -130.7126 -136.5951
quadrupole: -8.9040 25.8104 4.6446
quadrupole: 69.2112 -31.6643 -37.5469 -8.9040 25.8104 4.6446
hfenergy: -958.5130874 hartree
pointgroup: C01 [X(C16H36N6)]
dipole: 0.1184991 0.2337088 0.3075953 debye
polarizability: 298.930322|4.0136045|193.6968642|-22.9199989|1.5317973|185.4805664 unknown
InChI: InChI=1S/C16H36N6/c17-15(18)21-13-11-9-7-5-3-1-2-4-6-8-10-12-14-22-16(19)20/h1-14,17-20H2
charge 0 multiplicity 1
58 atoms
N  -8.576922 -0.643464 -0.439508
N  8.508082 -0.586531 -0.226169
N  -10.582018 -0.359312 0.911408
N  -9.627447 -2.480302 0.587644
N  10.843333 0.052979 -0.46626
N  9.948105 -1.747236 -1.680117
C  -0.742356 0.372224 0.388593
C  0.657144 0.583187 -0.232349
C  -1.901922 0.72778 -0.569103
C  1.813371 0.252411 0.738267
C  -3.299536 0.530574 0.060462
C  3.215172 0.492463 0.133547
C  -4.460259 0.913467 -0.885337
C  4.367378 0.180249 1.115323
C  -5.855591 0.703243 -0.25698
C  5.767726 0.447973 0.521873
C  -7.012326 1.114823 -1.191214
C  6.914524 0.153894 1.511683
C  -8.40309 0.816424 -0.591387
C  8.310772 0.364627 0.888892
C  -9.552273 -1.103744 0.306833
C  9.70362 -0.722343 -0.747531
H  -0.844621 -0.684979 0.712159
H  -0.828522 0.987179 1.309283
H  0.752366 -0.042033 -1.14487
H  0.752428 1.637469 -0.567857
H  -1.823315 0.109112 -1.487712
H  -1.794272 1.783445 -0.89664
H  1.729845 -0.806482 1.061747
H  1.703689 0.866056 1.657427
H  -3.416256 -0.528605 0.371866
H  -3.370192 1.13565 0.989001
H  3.293766 1.549621 -0.19727
H  3.334282 -0.127304 -0.779621
H  -4.346386 1.975766 -1.190304
H  -4.387043 0.314145 -1.817149
H  4.301479 -0.882108 1.431646
H  4.233097 0.786469 2.036848
H  -5.991848 -0.362065 0.013266
H  -5.922963 1.2829 0.688966
H  5.830646 1.508411 0.194894
H  5.927483 -0.170806 -0.381868
H  -6.940395 2.197683 -1.42499
H  -6.926538 0.564216 -2.14859
H  6.843575 -0.89615 1.857885
H  6.814459 0.804122 2.406096
H  -8.4978 1.360456 0.382428
H  -9.179162 1.236476 -1.273034
H  9.087258 0.241542 1.683212
H  8.377304 1.42115 0.532246
H  -10.656439 0.633359 0.708458
H  -11.043185 -0.71105 1.747851
H  -8.861996 -3.028939 0.197752
H  -10.543702 -2.925142 0.63662
H  10.750221 0.867806 0.133186
H  11.774024 -0.333431 -0.607889
H  9.145997 -2.350635 -1.85752
H  10.576125 -1.563492 -2.462193
