program: LAMMPS
programVersion: 29 Sep 2021 - Update 3
lattice: 12.912735 0 0
lattice: 0 12.912735 0
lattice: 0 0 12.912735
formula: Cu108O54
InChI: InChI=1S/108Cu.54O
162 atoms
Cu 1.076061 1.076061 3.228184
Cu 3.228184 1.076061 1.076061
Cu 1.076061 3.228184 1.076061
Cu 3.228184 3.228184 3.228184
O  2.152122 2.152122 2.152122
O  0.0000 0.0000 0.0000
Cu 1.076061 1.076061 7.532428
Cu 3.228184 1.076061 5.380306
Cu 1.076061 3.228184 5.380306
Cu 3.228184 3.228184 7.532428
O  2.152122 2.152122 6.456367
O  0.0000 0.0000 4.304245
Cu 1.076061 1.076061 11.836673
Cu 3.228184 1.076061 9.684551
Cu 1.076061 3.228184 9.684551
Cu 3.228184 3.228184 11.836673
O  2.152122 2.152122 10.760612
O  0.0000 0.0000 8.60849
Cu 1.076061 5.380306 3.228184
Cu 3.228184 5.380306 1.076061
Cu 1.076061 7.532428 1.076061
Cu 3.228184 7.532428 3.228184
O  2.152122 6.456367 2.152122
O  0.0000 4.304245 0.0000
Cu 1.076061 5.380306 7.532428
Cu 3.228184 5.380306 5.380306
Cu 1.076061 7.532428 5.380306
Cu 3.228184 7.532428 7.532428
O  2.152122 6.456367 6.456367
O  0.0000 4.304245 4.304245
Cu 1.076061 5.380306 11.836673
Cu 3.228184 5.380306 9.684551
Cu 1.076061 7.532428 9.684551
Cu 3.228184 7.532428 11.836673
O  2.152122 6.456367 10.760612
O  0.0000 4.304245 8.60849
Cu 1.076061 9.684551 3.228184
Cu 3.228184 9.684551 1.076061
Cu 1.076061 11.836673 1.076061
Cu 3.228184 11.836673 3.228184
O  2.152122 10.760612 2.152122
O  0.0000 8.60849 0.0000
Cu 1.076061 9.684551 7.532428
Cu 3.228184 9.684551 5.380306
Cu 1.076061 11.836673 5.380306
Cu 3.228184 11.836673 7.532428
O  2.152122 10.760612 6.456367
O  0.0000 8.60849 4.304245
Cu 1.076061 9.684551 11.836673
Cu 3.228184 9.684551 9.684551
Cu 1.076061 11.836673 9.684551
Cu 3.228184 11.836673 11.836673
O  2.152122 10.760612 10.760612
O  0.0000 8.60849 8.60849
Cu 5.380306 1.076061 3.228184
Cu 7.532428 1.076061 1.076061
Cu 5.380306 3.228184 1.076061
Cu 7.532428 3.228184 3.228184
O  6.456367 2.152122 2.152122
O  4.304245 0.0000 0.0000
Cu 5.380306 1.076061 7.532428
Cu 7.532428 1.076061 5.380306
Cu 5.380306 3.228184 5.380306
Cu 7.532428 3.228184 7.532428
O  6.456367 2.152122 6.456367
O  4.304245 0.0000 4.304245
Cu 5.380306 1.076061 11.836673
Cu 7.532428 1.076061 9.684551
Cu 5.380306 3.228184 9.684551
Cu 7.532428 3.228184 11.836673
O  6.456367 2.152122 10.760612
O  4.304245 0.0000 8.60849
Cu 5.380306 5.380306 3.228184
Cu 7.532428 5.380306 1.076061
Cu 5.380306 7.532428 1.076061
Cu 7.532428 7.532428 3.228184
O  6.456367 6.456367 2.152122
O  4.304245 4.304245 0.0000
Cu 5.380306 5.380306 7.532428
Cu 7.532428 5.380306 5.380306
Cu 5.380306 7.532428 5.380306
Cu 7.532428 7.532428 7.532428
O  6.456367 6.456367 6.456367
O  4.304245 4.304245 4.304245
Cu 5.380306 5.380306 11.836673
Cu 7.532428 5.380306 9.684551
Cu 5.380306 7.532428 9.684551
Cu 7.532428 7.532428 11.836673
O  6.456367 6.456367 10.760612
O  4.304245 4.304245 8.60849
Cu 5.380306 9.684551 3.228184
Cu 7.532428 9.684551 1.076061
Cu 5.380306 11.836673 1.076061
Cu 7.532428 11.836673 3.228184
O  6.456367 10.760612 2.152122
O  4.304245 8.60849 0.0000
Cu 5.380306 9.684551 7.532428
Cu 7.532428 9.684551 5.380306
Cu 5.380306 11.836673 5.380306
Cu 7.532428 11.836673 7.532428
O  6.456367 10.760612 6.456367
O  4.304245 8.60849 4.304245
Cu 5.380306 9.684551 11.836673
Cu 7.532428 9.684551 9.684551
Cu 5.380306 11.836673 9.684551
Cu 7.532428 11.836673 11.836673
O  6.456367 10.760612 10.760612
O  4.304245 8.60849 8.60849
Cu 9.684551 1.076061 3.228184
Cu 11.836673 1.076061 1.076061
Cu 9.684551 3.228184 1.076061
Cu 11.836673 3.228184 3.228184
O  10.760612 2.152122 2.152122
O  8.60849 0.0000 0.0000
Cu 9.684551 1.076061 7.532428
Cu 11.836673 1.076061 5.380306
Cu 9.684551 3.228184 5.380306
Cu 11.836673 3.228184 7.532428
O  10.760612 2.152122 6.456367
O  8.60849 0.0000 4.304245
Cu 9.684551 1.076061 11.836673
Cu 11.836673 1.076061 9.684551
Cu 9.684551 3.228184 9.684551
Cu 11.836673 3.228184 11.836673
O  10.760612 2.152122 10.760612
O  8.60849 0.0000 8.60849
Cu 9.684551 5.380306 3.228184
Cu 11.836673 5.380306 1.076061
Cu 9.684551 7.532428 1.076061
Cu 11.836673 7.532428 3.228184
O  10.760612 6.456367 2.152122
O  8.60849 4.304245 0.0000
Cu 9.684551 5.380306 7.532428
Cu 11.836673 5.380306 5.380306
Cu 9.684551 7.532428 5.380306
Cu 11.836673 7.532428 7.532428
O  10.760612 6.456367 6.456367
O  8.60849 4.304245 4.304245
Cu 9.684551 5.380306 11.836673
Cu 11.836673 5.380306 9.684551
Cu 9.684551 7.532428 9.684551
Cu 11.836673 7.532428 11.836673
O  10.760612 6.456367 10.760612
O  8.60849 4.304245 8.60849
Cu 9.684551 9.684551 3.228184
Cu 11.836673 9.684551 1.076061
Cu 9.684551 11.836673 1.076061
Cu 11.836673 11.836673 3.228184
O  10.760612 10.760612 2.152122
O  8.60849 8.60849 0.0000
Cu 9.684551 9.684551 7.532428
Cu 11.836673 9.684551 5.380306
Cu 9.684551 11.836673 5.380306
Cu 11.836673 11.836673 7.532428
O  10.760612 10.760612 6.456367
O  8.60849 8.60849 4.304245
Cu 9.684551 9.684551 11.836673
Cu 11.836673 9.684551 9.684551
Cu 9.684551 11.836673 9.684551
Cu 11.836673 11.836673 11.836673
O  10.760612 10.760612 10.760612
O  8.60849 8.60849 8.60849
initenergy: -749.870488029573
energy: -749.870488029802
