program: Gaussian 09
title: 000044928
version: EM64L-G09RevD.01
frameworkgroup: C1[X(C10H16N2O)]
method: RPBEPBE
basis: SDD
operation: Freq
keyword: #p
keyword: freq=noraman
keyword: PBEPBE/SDD
title: #p freq=noraman PBEPBE/SDD
converged: YES YES NO NO
title: Mulliken charges:
elementType: O N N C C C C C C C C C C H H H H H H H H H H H H H H H H
charge: -0.268756 -0.284799 -0.291851 -0.569176 0.496252 -0.397202 -0.416716 -0.384569 -0.353297 -0.355224 0.316246 -0.627362 -0.538334 0.199221 0.226783 0.222533 0.217529 0.228365 0.235179 0.253362 0.237306 0.247420 0.268404 0.214906 0.218884 0.221698 0.219731 0.219456 0.244009
chargesum: 0.00000
title: Mulliken charges with hydrogens summed into heavy atoms:
elementType: O N N C C C C C C C C C C
charge: -0.268756 -0.031437 -0.023447 -0.143171 0.496252 0.042860 -0.188351 -0.149390 -0.115990 -0.107804 0.316246 0.028126 0.144863
polarizability: 1.90700384e+02 -4.98725264e+00 1.13954054e+02 -1.25595968e+01 -6.73640957e+00 8.55473786e+01
1716.lowfreq: -18.0778 -8.1482 -6.9123 -0.0008 -0.0007 -0.0006 11.8634 28.5378 41.5878
frequency: 11.0584 28.3256 41.5742 87.5375 93.7374 97.5049 145.2618 186.1157 218.2007 240.2538 258.7525 310.8181 335.9677 375.9549 412.9388 430.9332 464.1404 514.7046 552.7034 633.3049 708.2418 732.0698 772.0237 801.8323 811.7619 823.9281 829.2997 845.0397 935.5988 952.8380 963.2776 989.4790 1002.8859 1023.2374 1042.3594 1054.4373 1074.1387 1111.8668 1113.7017 1119.5007 1144.0105 1156.5748 1178.1651 1214.3631 1228.0814 1237.5292 1264.1621 1290.1048 1305.6824 1346.2276 1381.7919 1396.7351 1415.7532 1420.5285 1436.0406 1453.3075 1466.1461 1473.7737 1475.3300 1485.3513 1493.2159 1494.4475 1502.4551 1584.9572 1624.6939 2922.9893 2926.0363 2956.6808 2977.3668 3005.5955 3026.4499 3043.0106 3048.1177 3082.4293 3117.8987 3122.7685 3123.4170 3158.7508 3164.6959 3327.8478 3359.3679
redmass: 3.4045 2.2708 4.2520 2.5449 3.2712 2.1810 3.8952 3.2255 2.8182 1.2738 1.1833 4.1614 2.7242 3.8984 2.9494 4.2497 3.5272 3.4618 2.9171 6.7399 4.0790 3.7207 3.1743 1.2056 1.5337 1.7968 1.3653 1.8320 1.3824 1.4329 1.3491 8.5631 2.6507 2.0308 2.6491 2.4424 4.1322 1.2610 1.3511 1.4627 1.2620 1.3282 1.2294 1.9317 3.2550 1.7822 1.1597 1.5001 1.2901 1.3901 4.7967 1.2397 3.3296 1.1555 1.1701 1.0414 1.0504 1.0771 1.0901 1.1085 1.0529 1.0887 2.4675 7.0337 6.4943 1.0482 1.0614 1.0331 1.0637 1.0915 1.0886 1.1038 1.1012 1.0985 1.0894 1.0949 1.0934 1.0937 1.0953 1.0744 1.0749
irintensity: 0.5873 3.8215 0.4524 4.7180 3.4037 4.6806 3.5651 0.8334 4.1132 0.1024 0.7385 0.0374 0.6457 7.9517 0.0027 1.8988 1.3980 18.7967 21.2332 0.3289 7.3447 1.3256 4.7455 4.2288 23.3187 3.0325 124.7385 78.5460 0.1021 0.5018 0.0332 40.3655 8.9912 2.1104 5.4018 15.6530 7.7419 0.4516 21.5302 1.3586 19.3596 0.5674 52.0678 21.0414 156.3450 6.2323 0.5278 1.9247 0.4307 0.4433 6.6716 21.0120 1.1752 0.1324 9.9067 13.4921 13.2478 59.5731 5.8846 4.3116 20.5544 3.4459 119.0656 6.9049 37.3500 174.3780 9.2525 69.1007 32.5765 26.6198 46.9475 52.1585 31.2686 31.9750 22.2441 34.6725 5.0557 17.1948 4.9246 2.3855 6.2395
temp: 298.150 k
press: 1.00000 atm
elementType: 8 7 7 6 6 6 6 6 6 6 6 6 6 1 1 1 1 1 1 1 1 1 1 1 1 1 1 1 1
symmnumber: 1
zpe: 645864.8 jmol-1
zpe.correction: 0.245997 hartree
zpe.thermalcorrener: 0.260253 hartree
zpe.thermalcorrenthalpy: 0.261198 hartree
zpe.thermalcorrgfe: 0.201924 hartree
zpe.sumelectzpe: -574.311462 hartree
zpe.sumelectthermal: -574.297205 hartree
zpe.sumelectthermalent: -574.296261 hartree
zpe.sumelectthermalfe: -574.355535 hartree
dipole: 0.2494 -1.4675 0.1153
dipole: 1.4930
quadrupole: -66.1096 -74.9425 -81.3828
quadrupole: -8.9964 -1.1490 -4.2481
quadrupole: 8.0354 -0.7975 -7.2379 -8.9964 -1.1490 -4.2481
hfenergy: -574.5574589 hartree
pointgroup: C01 [X(C10H16N2O1)]
dipole: 0.0897928 -0.5666743 0.125972 debye
polarizability: 190.4446839|-7.9085046|111.7359121|-12.0426564|-10.2357365|88.0212208 unknown
InChI: InChI=1S/C10H16N2O/c1-11-12-8-7-9-3-5-10(13-2)6-4-9/h3-6,11-12H,7-8H2,1-2H3
charge 0 multiplicity 1
29 atoms
O  4.1727 0.176633 -0.618081
N  -3.716563 0.087382 0.262381
N  -4.60575 -0.384074 -0.864347
C  -1.361835 0.277232 1.029487
C  0.106487 0.224443 0.635273
C  -2.294916 -0.060108 -0.159786
C  0.86597 -0.960653 0.777113
C  0.749788 1.360919 0.07322
C  2.220775 -1.029599 0.375605
C  2.095654 1.315624 -0.333396
C  2.836662 0.116483 -0.184024
C  -6.021456 -0.254987 -0.434104
C  4.979303 -1.037289 -0.484397
H  -1.558915 -0.438892 1.852755
H  -1.633198 1.282176 1.40279
H  -2.071534 -1.077694 -0.55335
H  -2.10597 0.65764 -0.982493
H  0.395785 -1.851059 1.213328
H  0.187749 2.296313 -0.040037
H  -3.89563 -0.593721 1.025224
H  2.775162 -1.964131 0.505057
H  2.594929 2.190366 -0.761497
H  -4.429865 0.29606 -1.626367
H  -6.268349 0.73909 0.001097
H  -6.24805 -1.02952 0.322292
H  -6.66825 -0.446026 -1.308495
H  4.555237 -1.871589 -1.077185
H  5.071666 -1.34676 0.575316
H  5.970415 -0.76926 -0.879179
