program: Gaussian 09
title: 000044932
version: EM64L-G09RevD.01
frameworkgroup: C1[X(C4H12N2O3S)]
method: RPBEPBE
basis: SDD
operation: Freq
keyword: #p
keyword: freq=noraman
keyword: PBEPBE/SDD
title: #p freq=noraman PBEPBE/SDD
converged: NO YES NO NO
title: Mulliken charges:
elementType: S O O O N N C C C C H H H H H H H H H H H H
charge: 0.961622 -0.647837 -0.593814 -0.676613 -0.281344 -0.061872 -0.049504 -0.482586 -0.701809 -0.651888 0.254479 0.283797 0.224483 0.293437 0.430528 0.230279 0.201094 0.239209 0.262355 0.216567 0.195042 0.354374
chargesum: 0.00000
title: Mulliken charges with hydrogens summed into heavy atoms:
elementType: S O O O N N C C C C
charge: 0.961622 -0.293463 -0.593814 -0.246085 0.002452 -0.061872 0.204975 0.035334 -0.031227 0.022076
polarizability: 1.17356005e+02 -1.13497838e+01 1.04971764e+02 -4.66402975e+00 -4.32876089e+00 7.38783006e+01
1716.lowfreq: -11.0059 -6.2185 -0.0025 -0.0005 0.0020 13.0035 26.1921 33.4395 49.3449
frequency: 25.5838 33.1564 49.1171 65.3508 99.2487 106.8448 179.2890 189.3768 208.3430 227.7537 249.7297 268.0805 280.1444 333.1403 350.9399 382.3773 434.3560 456.0372 471.5762 492.8878 544.5962 721.9576 753.1870 845.0488 878.9953 921.9089 927.8547 929.7586 952.7273 1026.6609 1106.0636 1138.2657 1163.0872 1187.6524 1217.8236 1254.0809 1318.6229 1343.4945 1383.1145 1399.3225 1420.6307 1433.1832 1461.4511 1469.6737 1481.8437 1485.8868 1490.6787 1588.8001 1621.0183 2978.4053 2980.7987 3021.3693 3056.0102 3073.2970 3082.8677 3093.2867 3102.8675 3198.0636 3447.8991 3478.3905
redmass: 7.1740 3.0546 5.3561 5.0096 4.2603 5.8787 2.6449 2.0847 1.0371 2.1207 1.5387 3.0395 3.1556 2.1827 2.2425 9.0110 2.3001 1.8097 4.0591 3.7675 2.9826 9.1372 1.2880 2.2701 7.2366 1.6174 1.3274 1.2711 1.5723 1.2300 1.6889 2.1362 2.0150 2.5680 1.0745 2.2750 1.5081 1.2170 1.2122 1.2198 1.1675 1.2014 1.0563 1.0506 1.0664 1.0975 1.0988 1.5191 2.2489 1.0377 1.0379 1.0850 1.0558 1.0976 1.0986 1.1007 1.0996 1.1199 1.0764 1.0661
irintensity: 3.9460 0.7213 3.6333 2.0236 2.4910 3.8294 54.8572 21.2824 0.1760 26.8579 24.2384 2.9793 21.5487 15.5194 114.4929 1.6756 35.9362 86.8485 65.7618 61.8641 40.9830 101.9177 0.7991 3.3132 94.7255 2.3775 116.8590 2.7547 3.4051 68.2232 12.4558 22.8871 10.8728 113.8317 165.1061 50.2110 23.9080 106.3077 23.2325 24.5329 525.7819 505.3064 5.2450 6.6546 146.9761 30.1330 177.8420 1518.2733 661.0068 17.1247 30.6396 3.9496 39.2809 9.0985 63.9315 17.1936 28.6856 4.7766 6.3150 20.3016
temp: 298.150 k
press: 1.00000 atm
elementType: 16 8 8 8 7 7 6 6 6 6 1 1 1 1 1 1 1 1 1 1 1 1
symmnumber: 1
zpe: 441924.3 jmol-1
zpe.correction: 0.168320 hartree
zpe.thermalcorrener: 0.182651 hartree
zpe.thermalcorrenthalpy: 0.183596 hartree
zpe.thermalcorrgfe: 0.125431 hartree
zpe.sumelectzpe: -891.885929 hartree
zpe.sumelectthermal: -891.871598 hartree
zpe.sumelectthermalent: -891.870654 hartree
zpe.sumelectthermalfe: -891.928818 hartree
dipole: 5.1507 2.9686 0.0098
dipole: 5.9449
quadrupole: -60.0575 -63.2338 -75.2750
quadrupole: -0.5326 2.3173 5.0146
quadrupole: 6.1312 2.9550 -9.0862 -0.5326 2.3173 5.0146
hfenergy: -892.0542492 hartree
pointgroup: C01 [X(C4H12N2O3S1)]
dipole: -1.8159076 -1.3670104 -0.5516416 debye
dipolederiv: 1.530923 0.0049736 0.2068605 -0.1713458 0.885204 0.1588795 0.3582263 0.3584954 1.1416715 -0.7405174 0.0345813 0.2433792 0.1788306 -0.7539002 -0.2780249 0.2177228 -0.0670402 -0.3778455 -0.5050819 -0.0661823 -0.0143049 0.0546462 -0.4104647 0.1603857 -0.3004979 -0.3299974 -0.7515565 -1.5345884 -0.3270462 -0.392096 -0.8186439 -0.8643305 -0.2541755 -0.1685204 -0.0210389 -0.5787025 -0.8183527 0.6731698 0.3247421 -0.1605897 -0.1622869 0.2659621 0.2864082 -0.0332739 -0.5486603 0.6220441 -0.7236965 -0.4579932 -0.5350278 -0.5205325 -0.1314423 -0.3398914 0.1081666 0.1255274 0.402777 -0.2534883 -0.0336231 -0.3675715 0.5609245 0.0044822 -0.1771457 0.0347401 0.3928068 -0.3343404 0.1952736 0.0011681 0.4396403 0.0024975 -0.0250943 0.1735277 0.0214969 -0.3682588 -0.0428851 0.04148 0.0828891 0.0529724 -0.0070396 0.0325962 0.085156 0.0347124 0.0229898 -0.0161367 0.0421273 0.0624299 0.1216555 -0.0728753 0.0712541 0.0487203 0.1266165 -0.1091973 -0.0068082 -0.0349749 -0.0784659 0.0204698 -0.0066557 -0.0418762 -0.0751545 -0.0345047 -0.03121 0.0129564 -0.0671452 0.0081306 0.0197784 0.0426833 -0.1199183 -0.024418 -0.1313204 0.2895105 0.0067247 -0.1545775 -0.0014467 -0.1093109 -0.0718395 -0.0719896 0.0158911 -0.053239 0.1854766 0.1243336 0.0479411 0.0619912 0.0474171 0.1197081 -0.0061829 0.0195267 -0.000983 0.2105943 0.8696466 0.5294098 0.1756076 1.1883315 1.0485109 0.3489265 0.0324693 0.082541 0.2557283 0.0132267 0.0772115 0.0387898 0.1182058 -0.0673722 -0.0678347 0.0351806 -0.0394878 0.0942953 -0.0054288 -0.0728117 -0.0488231 -0.115512 0.0211156 -0.0665127 -0.1117521 -0.1033639 -0.0274013 0.0867718 0.011824 -0.0441795 -0.0173771 0.0204438 0.133884 -0.0148578 0.1200526 -0.0688975 -0.0117344 -0.0475053 0.0975939 -0.0401307 0.0932271 0.0250922 0.1087341 0.0293228 0.0398727 0.0325121 0.1098047 0.0163236 0.1458082 -0.0987127 -0.052911 0.0130596 -0.0610914 0.0679688 -0.0177523 -0.0552729 -0.1217683 -0.1186434 0.0124726 -0.0886602 -0.0844514 -0.0376881 -0.0243746 0.3317102 0.0349043 -0.1272051 0.0663969 0.2292223 0.0031598 -0.0979336 -0.0031155 0.0596622 unknown
polarizability: 120.7820942|-8.9365981|93.0132527|-1.3429423|14.0264941|82.4107225 unknown
InChI: InChI=1S/C4H12N2O3S/c1-4(2)5-6(3)11-9-10(7)8/h4-5,7H,3H2,1-2H3
charge 0 multiplicity 1
22 atoms
S  2.391962 1.358911 0.306861
O  2.992341 -0.290234 -0.496588
O  2.49384 1.0248 1.891936
O  0.754975 1.2367 -0.241881
N  -1.661618 -1.069617 0.019518
N  -0.363988 -1.011097 -0.392561
C  -2.361592 0.195224 0.367212
C  0.30125 -2.014011 -0.915842
C  -3.659927 -0.175867 1.108412
C  -2.620577 1.080866 -0.874744
H  -1.692676 0.744062 1.056023
H  -2.224547 -1.884165 -0.256095
H  -0.156393 -2.999498 -1.080349
H  1.352715 -1.82061 -1.150221
H  0.278812 0.198649 -0.244037
H  -4.186196 0.741163 1.422557
H  -4.347651 -0.74465 0.452072
H  -3.448033 -0.780124 2.00782
H  -1.669388 1.342019 -1.369875
H  -3.111231 2.022985 -0.57004
H  -3.279111 0.56699 -1.600312
H  3.522134 -0.735595 0.227033
