program: Gaussian 09
title: 000044856
version: EM64L-G09RevD.01
frameworkgroup: C1[X(C11H21NO2)]
method: RPBEPBE
basis: SDD
operation: Freq
keyword: #p
keyword: freq=noraman
keyword: PBEPBE/SDD
title: #p freq=noraman PBEPBE/SDD
converged: YES YES NO NO
title: Mulliken charges:
elementType: O O N C C C C C C C C C C C H H H H H H H H H H H H H H H H H H H H H
charge: -0.271562 -0.251227 -0.129820 0.030816 -0.409292 -0.369657 -0.415568 -0.390575 -0.330739 -0.761189 -0.440734 -0.476032 0.241489 -0.505741 0.172341 0.200406 0.187798 0.172731 0.222875 0.214100 0.190228 0.193788 0.203487 0.190754 0.207389 0.217375 0.214466 0.226819 0.236533 0.213628 0.235774 0.269095 0.231153 0.239068 0.240022
chargesum: 0.00000
title: Mulliken charges with hydrogens summed into heavy atoms:
elementType: O O N C C C C C C C C C C C
charge: -0.271562 -0.251227 -0.129820 0.203157 -0.021088 0.025948 -0.011241 0.006701 0.067404 -0.102529 0.009427 0.028836 0.241489 0.204503
polarizability: 1.58568831e+02 -1.15777344e+00 1.24913347e+02 -1.27052161e+00 -3.52330474e+00 1.15009496e+02
1716.lowfreq: -12.3523 -0.0006 -0.0005 -0.0002 0.7978 6.9390 15.7035 25.0827 31.4429
frequency: 13.8338 25.0350 31.3258 69.0308 97.9447 102.0713 131.5830 168.5109 192.9214 219.7947 250.3439 265.8286 282.8871 321.1161 325.0423 361.9517 406.1264 416.6445 438.1838 464.7818 511.6333 541.5509 579.2484 674.9977 695.5884 784.1688 813.8453 827.2153 837.0827 869.6086 876.1858 894.2868 927.0173 969.8135 978.3632 989.4579 997.8145 1044.7175 1065.3475 1079.1320 1090.2440 1098.5142 1111.9809 1122.6346 1126.3007 1138.8668 1147.4828 1156.9932 1167.9659 1204.7962 1218.2464 1250.0972 1262.6781 1266.1850 1275.3814 1302.4954 1312.9751 1324.1989 1338.3848 1346.1007 1350.7873 1354.8126 1367.7824 1379.3774 1387.4493 1421.3551 1445.7260 1448.9355 1451.9809 1457.8027 1463.9905 1464.9282 1466.0445 1473.1078 1477.9255 1484.4907 1494.2910 1639.0524 2807.4276 2826.7090 2856.6506 2965.8527 2967.7461 2974.7879 2982.5803 2985.1472 3001.3653 3002.0235 3029.8611 3038.3305 3043.6515 3048.0621 3051.8011 3059.2990 3075.1134 3078.7469 3084.0897 3101.9310 3145.3869
redmass: 3.2026 4.7180 4.9401 2.8045 1.1261 2.6900 3.6025 2.2606 2.4740 1.2810 2.6065 2.5489 3.4190 1.8288 1.7734 2.5302 3.5129 3.1697 2.9420 2.8142 2.9615 1.7026 3.0395 3.9558 2.5672 1.5700 1.5445 1.9272 4.5310 2.3697 2.1957 1.4384 1.9919 4.1786 2.1852 1.8489 1.3153 1.9616 2.3358 2.0431 2.5858 2.2779 1.2732 2.1524 1.5609 2.4017 1.4430 2.4574 1.5411 1.6101 1.6011 1.4413 1.2826 1.2302 1.2062 1.2829 1.3862 1.2627 1.4202 1.4693 1.6186 1.6153 1.3469 1.3963 1.2089 1.1914 1.0914 1.0839 1.0504 1.0883 1.0850 1.0528 1.0772 1.0911 1.0650 1.0834 1.0520 8.9390 1.0803 1.0719 1.0716 1.0617 1.0655 1.0595 1.0376 1.0615 1.0481 1.0437 1.0964 1.1026 1.0922 1.0892 1.1016 1.0906 1.0977 1.0972 1.0984 1.1043 1.1046
irintensity: 0.3277 1.5613 0.4764 0.3124 0.1717 1.3155 1.6137 0.5292 7.6313 2.9698 1.2792 0.3622 28.6360 0.6719 2.0765 0.5610 0.7966 0.1710 1.1671 1.7049 8.5706 0.7409 6.6471 6.2153 18.0904 9.0891 3.7128 0.7532 10.9198 2.4841 4.8550 9.8264 7.8762 41.5794 3.6347 7.4836 3.5002 16.0810 22.8046 17.4466 34.7164 43.0924 0.0536 59.0821 24.4980 126.4741 8.5520 13.9967 30.4317 24.8594 64.0232 36.7972 16.2448 8.4583 8.5493 6.7610 37.5461 13.7364 1.0745 0.4260 9.3696 32.2501 6.2737 8.4904 16.7379 24.2368 7.3621 16.8515 13.8940 10.5886 1.0102 13.2646 6.2210 9.2109 5.8610 26.6804 14.7041 155.5856 54.4472 112.1117 158.6437 44.0582 38.1540 25.5990 39.3265 27.4189 41.7638 31.1903 64.0484 33.4193 26.0770 8.7425 76.8458 4.3420 43.1565 48.4942 48.9419 29.6393 18.4915
temp: 298.150 k
press: 1.00000 atm
elementType: 8 8 7 6 6 6 6 6 6 6 6 6 6 6 1 1 1 1 1 1 1 1 1 1 1 1 1 1 1 1 1 1 1 1 1
symmnumber: 1
zpe: 807245.8 jmol-1
zpe.correction: 0.307464 hartree
zpe.thermalcorrener: 0.323309 hartree
zpe.thermalcorrenthalpy: 0.324253 hartree
zpe.thermalcorrgfe: 0.261706 hartree
zpe.sumelectzpe: -635.815612 hartree
zpe.sumelectthermal: -635.799767 hartree
zpe.sumelectthermalent: -635.798823 hartree
zpe.sumelectthermalfe: -635.861369 hartree
dipole: -0.9574 1.1674 -0.5189
dipole: 1.5965
quadrupole: -77.6370 -88.0037 -86.6889
quadrupole: 2.3387 -5.3150 3.7080
quadrupole: 6.4729 -3.8938 -2.5791 2.3387 -5.3150 3.7080
hfenergy: -636.1230758 hartree
pointgroup: C01 [X(C11H21N1O2)]
dipole: 0.3868688 -0.4648718 -0.1695291 debye
polarizability: 158.4951454|-0.7571635|125.2384567|2.4192572|2.9740437|114.7580723 unknown
InChI: InChI=1S/C11H21NO2/c1-10-6-3-4-8-12(10)9-5-7-11(13)14-2/h10H,3-9H2,1-2H3
charge 0 multiplicity 1
35 atoms
O  -3.785071 -0.547885 -0.974488
O  -3.219667 1.146636 0.518819
N  1.342247 -0.207135 0.398188
C  2.636661 -0.867374 0.021701
C  3.345221 -0.032899 -1.077058
C  1.557883 1.196056 0.853048
C  3.567063 1.435121 -0.659995
C  2.223966 2.060175 -0.232481
C  0.536343 -0.96761 1.392117
C  2.431463 -2.310329 -0.489438
C  -0.948208 -0.53277 1.422443
C  -1.605127 -0.666488 0.032109
C  -2.914387 0.084824 -0.074877
C  -5.078454 0.140109 -1.201331
H  3.317674 -0.898056 0.916053
H  2.720605 -0.068886 -1.992398
H  4.312589 -0.516349 -1.315508
H  2.192811 1.215925 1.779239
H  0.579843 1.631497 1.121644
H  4.022444 2.007915 -1.490239
H  4.279387 1.475888 0.19029
H  2.369888 3.086804 0.155233
H  1.546983 2.124505 -1.10641
H  0.96371 -0.872394 2.423185
H  0.574904 -2.037513 1.126309
H  3.362991 -2.667332 -0.965004
H  2.180164 -3.028105 0.310521
H  1.626718 -2.331661 -1.247638
H  -1.055378 0.510749 1.768454
H  -1.481224 -1.160826 2.162503
H  -1.764973 -1.721014 -0.252817
H  -0.894503 -0.241636 -0.708334
H  -5.610947 -0.493445 -1.924619
H  -4.909334 1.151978 -1.607197
H  -5.639886 0.223125 -0.255322
