program: Gaussian 09
title: 000005206
version: EM64L-G09RevD.01
frameworkgroup: C1[X(C4H3F7O)]
method: RPBEPBE
basis: SDD
operation: Freq
keyword: #pfreq=noraman
keyword: PBEPBE/SDD
title: #p freq=noraman PBEPBE/SDD
converged: NO YES NO NO
title: Mulliken charges:
elementType: F F F F F F F O C C C C H H H
charge: -0.162055 -0.122725 -0.138344 -0.145955 -0.133869 -0.125860 -0.225483 -0.241283 -0.208509 0.414543 0.402194 -0.100697 0.314442 0.239606 0.233995
chargesum: 0.00000
title: Mulliken charges with hydrogens summed into heavy atoms:
elementType: F F F F F F F O C C C C
charge: -0.162055 -0.122725 -0.138344 -0.145955 -0.133869 -0.125860 -0.225483 -0.241283 0.105933 0.414543 0.402194 0.372904
polarizability: 5.83465591e+01 -1.47496285e+00 4.73269387e+01 1.79566720e+00 -9.43045644e-01 4.63255257e+01
1716.lowfreq: -8.5636 -0.0017 -0.0015 -0.0011 5.4199 8.4285 22.7667 44.1482 57.4953
frequency: 22.6301 44.1199 57.4625 97.1885 150.1986 172.8357 200.3354 260.8424 261.8388 296.0264 329.2636 388.9824 445.0928 462.2196 475.8239 504.8266 533.5251 599.2390 648.6623 806.6922 829.9477 905.3300 928.8009 973.2485 1008.4273 1039.8133 1078.8065 1091.5915 1107.1857 1190.2611 1192.9709 1215.9108 1315.8055 1341.4104 1382.0355 1461.6675 3039.2895 3047.1837 3153.8262
redmass: 18.6802 9.7811 14.2033 7.5279 10.9061 5.8674 11.2877 8.0384 16.7249 18.1696 7.0663 9.2568 13.8734 17.3337 14.3616 9.0852 11.7570 11.3246 15.0706 6.3999 5.3412 9.0508 6.9075 6.7327 10.8436 5.1346 10.8849 5.0490 2.0020 3.2445 3.9844 1.5406 1.3250 1.5085 1.1391 1.0825 1.0581 1.0835 1.1132
irintensity: 0.0029 2.9746 0.4821 6.3739 7.0215 0.9687 2.7600 4.6184 0.3328 1.5275 9.1231 2.6440 12.0188 3.4297 2.2169 4.7232 13.5617 46.3494 5.3705 28.3691 55.3916 177.4634 23.0291 136.7020 2.8339 105.6264 501.7673 170.0299 64.0291 93.8401 112.4254 67.8923 29.0872 42.3486 3.6772 1.3859 37.2676 3.2639 9.9678
temp: 298.150 k
press: 1.00000 atm
elementType: 9 9 9 9 9 9 9 8 6 6 6 6 1 1 1
symmnumber: 1
zpe: 203731.9 jmol-1
zpe.correction: 0.077597 hartree
zpe.thermalcorrener: 0.089608 hartree
zpe.thermalcorrenthalpy: 0.090552 hartree
zpe.thermalcorrgfe: 0.037290 hartree
zpe.sumelectzpe: -927.371925 hartree
zpe.sumelectthermal: -927.359915 hartree
zpe.sumelectthermalent: -927.358970 hartree
zpe.sumelectthermalfe: -927.412232 hartree
dipole: 2.1279 -1.9088 -0.2991
dipole: 2.8742
quadrupole: -66.6675 -69.8092 -66.8655
quadrupole: -5.3667 3.3734 -0.2923
quadrupole: 1.1132 -2.0284 0.9152 -5.3667 3.3734 -0.2923
hfenergy: -927.4495221 hartree
pointgroup: C01 [X(C4H3F7O1)]
dipole: 1.0460235 -0.2546218 -0.3459677 debye
dipolederiv: -0.7006161 0.1352534 0.1196514 0.2285542 -0.509688 -0.0730513 0.1175345 -0.0295575 -0.3163678 -0.2935831 -0.0355663 0.1129096 -0.0711667 -0.400732 0.1868547 0.131996 0.1096163 -0.6933096 -0.5578763 -0.1260315 -0.2168471 -0.2334304 -0.4468627 -0.1365774 -0.2566006 -0.0878178 -0.4752494 -0.7361263 -0.1412208 -0.1997908 -0.0392206 -0.3489851 -0.0678724 -0.1566134 -0.0996445 -0.3926347 -0.34484 0.0154562 0.0323619 -0.0589193 -0.7977316 0.1116968 0.0487805 0.0811407 -0.3050782 -0.3455223 0.0293729 0.1337743 0.0535601 -0.2982237 -0.010915 0.0752511 0.0476342 -0.7535199 -0.3622791 0.0015842 -0.009955 -0.1768335 -0.5708127 0.2645088 0.2089435 0.2875452 -0.5391184 -1.1131898 -0.2594943 0.173271 -0.1192509 -0.5041513 0.0662507 0.0977828 0.0885968 -0.3481527 0.3505238 0.1638459 0.0752046 0.1796882 0.1070707 -0.0221106 0.2308889 0.0551916 0.0035341 1.4557731 0.069089 -0.0115019 0.0266244 1.3907867 0.0059029 -0.0199533 -0.0090118 1.4868337 1.477068 -0.016427 -0.00176 0.0003321 1.4600833 -0.0131766 0.0051387 -0.0150174 1.48861 1.0878269 0.1757838 -0.1862871 0.2011324 0.8527994 -0.2686858 -0.4651888 -0.3815877 0.8252183 0.0698941 -0.007659 0.022596 -0.0060532 0.0797539 0.0037257 -0.0491605 -0.015347 0.0189297 -0.0204283 -0.0228625 -0.0497525 -0.0524352 0.0546268 -0.0188674 -0.0632201 0.0162999 0.0010617 0.0333756 0.018876 0.0061256 0.0674184 -0.0679339 -0.0276831 0.0944207 -0.0480409 -0.0007567 unknown
polarizability: 57.4299965|3.7509138|48.626445|-0.271249|-0.7247779|45.9425819 unknown
InChI: InChI=1S/C4H3F7O/c5-1-12-2(3(6,7)8)4(9,10)11/h2H,1H2
charge 0 multiplicity 1
15 atoms
F  1.022564 -2.163792 -0.536915
F  -0.521425 -1.917071 1.105644
F  -1.176275 -2.00214 -1.065382
F  -2.384946 0.455572 -0.526475
F  -0.99022 2.21038 -0.184647
F  -1.425752 0.769653 1.507795
F  2.251471 1.607867 -1.289082
O  1.145235 0.450655 0.45611
C  0.007228 0.016223 -0.343687
C  -0.188336 -1.513093 -0.19001
C  -1.200178 0.858872 0.129798
C  2.383572 0.586604 -0.26224
H  0.148855 0.227148 -1.420272
H  3.110809 0.93119 0.485944
H  2.677299 -0.341467 -0.783082
