program: Orca
programVersion: 5.0.2
elementType: N C H C H C H H H O H C O N H C H C H H C O N H H C O N H C H C H H C O N H H C O N H C H C H H C H H S C H H H C O N H C H C H H C C H C H C H C H C H C O N H C H C H C H H H C H H C H H H C O N H C H C H H C H H C H H C H H N H H H C O N H C H C H H C O C O N H C H C H C H H H C H H C H H H C O N H C H C H H C N C H N H C H C O N H C H C H C H H H C H H C H H H C O N H C H C H H C H H C H H C H H N H H H C O N H C H C H H C C H C H C H C H C H C O N H C H C H H C N C H N H C H C O N H C H C H H C H H C O C O H H H O H O H O H
charge: 3
multiplicity: 1
keywords: TPSS D3BJ def2-TZVPP def2/J
keywords: PAL8 defgrid2 XYZFILE CHELPG
formula: C86H134N23O23S
InChI: InChI=1S/C86H134N23O23S/c1-9-45(4)69(107-79(124)58(35-50-24-16-13-17-25-50)101-74(119)55(30-33-133-8)96-77(122)61(38-64(89)111)103-78(123)62(39-65(90)112)105-82(127)68(91)48(7)110)83(128)98-54(27-19-21-32-88)73(118)104-63(40-67(115)116)81(126)109-71(47(6)11-3)85(130)106-60(37-52-42-93-44-95-52)80(125)108-70(46(5)10-2)84(129)97-53(26-18-20-31-87)72(117)100-57(34-49-22-14-12-15-23-49)75(120)102-59(36-51-41-92-43-94-51)76(121)99-56(86(131)132)28-29-66(113)114/h12-17,22-25,41-48,53-63,68-71,92-93,96-110,113,115,131H,9-11,18-21,26-40,89-90H2,1-8,87-88,91H3
267 atoms
N  -5.180851 17.294655 2.738304
C  -4.281609 16.701797 1.743638
H  -4.381745 15.622827 1.832951
C  -4.748233 17.088919 0.330859
H  -5.822696 16.913686 0.269211
C  -4.477958 18.542328 -0.059043
H  -4.949045 18.761022 -1.015276
H  -4.897276 19.202985 0.699535
H  -3.407507 18.721773 -0.133613
O  -4.124912 16.27609 -0.636133
H  -4.501902 16.522294 -1.484513
C  -2.80924 17.049673 1.969336
O  -2.435569 18.07088 2.549138
N  -1.941062 16.186807 1.448643
H  -2.314528 15.407447 0.922755
C  -0.510761 16.427482 1.333007
H  -0.359684 17.490053 1.131751
C  0.17685 16.073215 2.662746
H  0.224264 14.99122 2.77959
H  -0.40016 16.479592 3.494095
C  1.578205 16.64587 2.721137
O  2.506891 16.124749 2.129709
N  1.765969 17.760566 3.383871
H  0.987646 18.226145 3.820125
H  2.697013 18.134972 3.387218
C  0.052267 15.634605 0.147665
O  -0.480238 14.590619 -0.215003
N  1.148734 16.118032 -0.436237
H  1.544184 16.98193 -0.08891
C  1.832674 15.481391 -1.557366
H  1.139528 15.435352 -2.399686
C  3.038388 16.354988 -1.951167
H  3.536404 15.909439 -2.812439
H  3.754084 16.374882 -1.128872
C  2.667027 17.795422 -2.274925
O  2.36106 18.588383 -1.403884
N  2.673351 18.179029 -3.528757
H  2.924454 17.540304 -4.259898
H  2.433344 19.139416 -3.696515
C  2.283619 14.020097 -1.277907
O  2.498306 13.254526 -2.218538
N  2.455246 13.62111 -0.0097
H  2.297045 14.306143 0.717207
C  2.880593 12.271209 0.397576
H  3.661045 11.968491 -0.30171
C  3.568637 12.303078 1.77882
H  4.434575 12.963182 1.706227
H  3.938845 11.30256 2.004819
C  2.710305 12.781473 2.956823
H  1.870155 12.105187 3.105803
H  2.313236 13.765805 2.728948
S  3.629853 12.881164 4.51611
C  2.355323 13.625298 5.562577
H  2.734534 13.729111 6.576909
H  2.091321 14.606748 5.173797
H  1.47154 12.990096 5.570776
C  1.786895 11.1848 0.272193
O  1.275889 10.668632 1.261908
N  1.431782 10.802707 -0.959328
H  1.821456 11.350614 -1.720008
C  0.416171 9.782232 -1.303749
H  -0.477049 10.015626 -0.721742
C  0.053956 9.934506 -2.79621
H  -0.812088 9.306245 -3.00073
H  0.891132 9.554182 -3.383275
C  -0.272013 11.335358 -3.292588
C  0.253001 11.778105 -4.523341
H  0.904396 11.137917 -5.101179
C  -0.053727 13.061183 -5.009378
H  0.356576 13.398232 -5.95209
C  -0.886525 13.912585 -4.266174
H  -1.120762 14.903768 -4.628302
C  -1.41519 13.477997 -3.0386
H  -2.042434 14.135589 -2.451392
C  -1.113588 12.194141 -2.554023
H  -1.520965 11.88525 -1.600285
C  0.781868 8.322464 -0.946344
O  0.747669 7.436722 -1.809441
N  1.118647 8.069282 0.319172
H  1.132337 8.862195 0.951521
C  1.137603 6.736323 0.933853
H  1.859663 6.119069 0.398506
C  1.579385 6.849482 2.414354
H  0.824097 7.432736 2.947485
C  1.658606 5.470909 3.09598
H  2.062705 5.576353 4.102898
H  0.663611 5.03637 3.187623
H  2.294987 4.792135 2.529791
C  2.929115 7.591035 2.592756
H  3.184054 7.60162 3.654035
H  2.809758 8.631747 2.292784
C  4.117751 7.004467 1.81879
H  3.937764 7.053747 0.746723
H  5.011359 7.584632 2.044686
H  4.291868 5.970825 2.11112
C  -0.239596 6.08492 0.784647
O  -1.273535 6.75446 0.799478
N  -0.234295 4.770387 0.586769
H  0.649436 4.282011 0.660201
C  -1.410118 3.926492 0.366832
H  -2.280563 4.3542 0.865201
C  -1.687774 3.749518 -1.140717
H  -2.592225 3.151329 -1.269543
H  -0.855572 3.197407 -1.581601
C  -1.865057 5.059475 -1.916946
H  -0.979002 5.663398 -1.767682
H  -2.731266 5.60282 -1.535625
C  -2.026528 4.810557 -3.422053
H  -3.018142 4.390402 -3.602225
H  -1.282216 4.086827 -3.760756
C  -1.872239 6.1141 -4.215633
H  -2.563656 6.855024 -3.803905
H  -2.160432 5.929313 -5.253562
N  -0.47992 6.633789 -4.165779
H  -0.395098 7.514088 -4.654618
H  -0.184559 6.794345 -3.201106
H  0.176592 5.97801 -4.55859
C  -1.122784 2.559396 0.970643
O  0.037183 2.216559 1.203779
N  -2.168803 1.765502 1.131037
H  -3.077836 2.127212 0.909738
C  -1.998946 0.319979 1.102226
H  -1.260899 0.031729 1.854174
C  -3.345363 -0.337467 1.479444
H  -4.028123 -0.243812 0.632329
H  -3.776282 0.232558 2.306588
C  -3.287581 -1.81031 1.914479
O  -2.351207 -2.542493 1.507404
C  -1.485466 -0.1410 -0.291152
O  -1.639014 0.567936 -1.288578
N  -0.885626 -1.329829 -0.365567
H  -0.919647 -1.887881 0.483664
C  -0.270337 -1.928242 -1.565478
H  -0.66439 -1.401947 -2.43417
C  1.268306 -1.735005 -1.577821
H  1.598057 -2.023679 -2.577416
C  1.663636 -0.252449 -1.430024
H  2.736584 -0.141399 -1.585171
H  1.132518 0.339782 -2.175246
H  1.406248 0.120367 -0.438225
C  2.064576 -2.624763 -0.595589
H  3.125913 -2.407393 -0.718704
H  1.929757 -3.669039 -0.873195
C  1.732545 -2.492356 0.897122
H  2.442152 -3.083522 1.473997
H  1.802067 -1.453329 1.213621
H  0.730894 -2.869695 1.095408
C  -0.644794 -3.411883 -1.785338
O  -0.181044 -4.029621 -2.73869
N  -1.488909 -3.989108 -0.922629
H  -1.800961 -3.421592 -0.134039
C  -2.17301 -5.281328 -1.093899
H  -2.411166 -5.569432 -0.069176
C  -3.540864 -5.071774 -1.793035
H  -3.807406 -5.91819 -2.422285
H  -3.503796 -4.186897 -2.429823
C  -4.612621 -4.915995 -0.755561
N  -5.107339 -5.949011 0.053829
C  -5.70119 -5.329674 1.091852
H  -6.106098 -5.831523 1.959619
N  -5.587261 -3.997261 0.977162
H  -5.602435 -3.34425 1.767763
C  -4.921118 -3.721237 -0.19085
H  -4.515414 -2.762603 -0.479191
C  -1.394519 -6.513323 -1.603587
O  -1.993653 -7.446247 -2.148595
N  -0.104107 -6.630281 -1.304233
H  0.356994 -5.8157 -0.926103
C  0.655729 -7.89966 -1.389795
H  0.690392 -8.20647 -2.436383
C  2.10956 -7.626404 -0.919993
H  2.058894 -7.133271 0.052522
C  2.938007 -8.911332 -0.750226
H  3.954363 -8.675371 -0.444872
H  2.523746 -9.54232 0.03561
H  2.974857 -9.472789 -1.68435
C  2.813009 -6.671997 -1.918953
H  2.168086 -5.824308 -2.142959
H  2.994791 -7.197667 -2.856945
C  4.137137 -6.088654 -1.411245
H  4.493073 -5.338635 -2.118086
H  3.987528 -5.612115 -0.442839
H  4.897156 -6.863844 -1.325925
C  -0.042219 -9.034267 -0.595722
O  -0.741489 -8.781302 0.39194
N  0.168835 -10.289585 -1.016105
H  0.731105 -10.413383 -1.85052
C  -0.032066 -11.528924 -0.236991
H  0.017099 -11.304475 0.828454
C  -1.382751 -12.216786 -0.536663
H  -1.383673 -13.180878 -0.02297
H  -1.467863 -12.427385 -1.604541
C  -2.61467 -11.446181 -0.040644
H  -2.331665 -10.800338 0.791371
H  -3.34121 -12.165465 0.34156
C  -3.290399 -10.642223 -1.157895
H  -3.825701 -11.336212 -1.807902
H  -2.547043 -10.1212 -1.763444
C  -4.285237 -9.631136 -0.578439
H  -4.844356 -10.101897 0.233886
H  -4.989517 -9.346449 -1.364167
N  -3.577166 -8.423963 -0.101183
H  -3.095345 -8.009851 -0.892082
H  -4.209169 -7.710861 0.255819
H  -2.846955 -8.648893 0.568404
C  1.093691 -12.518526 -0.55369
O  1.682749 -12.418029 -1.625921
N  1.380396 -13.415112 0.387989
H  0.762529 -13.441645 1.190174
C  2.373227 -14.496831 0.300911
H  2.303605 -14.969389 -0.682261
C  3.809082 -13.970773 0.527564
H  4.470114 -14.831779 0.636278
H  3.834565 -13.427296 1.471659
C  4.423351 -13.105816 -0.561406
C  4.479806 -13.569324 -1.890194
H  4.046935 -14.524861 -2.150373
C  5.073185 -12.778044 -2.889759
H  5.091736 -13.132115 -3.911412
C  5.633993 -11.530791 -2.562955
H  6.088942 -10.927036 -3.333933
C  5.598409 -11.075294 -1.234663
H  6.036749 -10.119984 -0.98261
C  4.991153 -11.858869 -0.237762
H  4.9687 -11.507349 0.781828
C  2.023728 -15.571945 1.34853
O  2.741533 -15.767464 2.331857
N  0.846118 -16.182677 1.218818
H  0.329158 -16.016517 0.350334
C  0.144773 -16.888409 2.301821
H  0.855612 -17.133654 3.089382
C  -0.905775 -15.915864 2.873409
H  -1.42266 -16.39513 3.705046
H  -1.643999 -15.697939 2.100668
C  -0.325575 -14.607561 3.373012
N  -0.590664 -13.329119 2.859016
C  0.164376 -12.48078 3.56843
H  0.188533 -11.4089 3.420792
N  0.898471 -13.148371 4.475027
H  1.574426 -12.742148 5.10667
C  0.599376 -14.487591 4.36781
H  1.039856 -15.305188 4.919029
C  -0.480902 -18.232243 1.874006
O  -1.233123 -18.839551 2.633523
N  -0.178013 -18.711698 0.668219
H  0.439319 -18.136464 0.093973
C  -0.909131 -19.776711 -0.030842
H  -1.928495 -19.823509 0.353503
C  -0.963553 -19.439488 -1.539374
H  -1.604278 -20.177445 -2.023815
H  0.034308 -19.548366 -1.967306
C  -1.516531 -18.036542 -1.903597
H  -2.500704 -17.92774 -1.442822
H  -1.654981 -18.000727 -2.986217
C  -0.606201 -16.865498 -1.485598
O  0.634337 -17.031995 -1.517219
C  -0.255962 -21.136588 0.224375
O  0.767481 -21.216345 0.95223
H  -4.640867 17.706495 3.472337
H  -5.742436 17.998092 2.302644
H  -5.772603 16.583754 3.118369
O  -0.808503 -22.316915 -0.364205
H  -0.467588 -23.091089 0.089701
O  -1.136368 -15.799859 -0.959559
H  -2.051663 -15.725739 -1.239455
O  -4.282085 -2.24499 2.632389
H  -4.320877 -1.754317 3.456608
totalener: -6748.45773431 hartree
kineticenergy: 6721.88325215 hartree
exchangeener: -867.580744352001 hartree
correlationener: -34.157689300400 hartree
xcener: -901.738433652401 hartree
chargesum: 3.0000000
charge: 0.016521 0.025940 0.092715 0.084373 0.061841 -0.116326 0.076202 0.019649 0.097692 -0.329996 0.215164 0.202671 -0.379584 -0.143254 0.153727 0.143973 0.069160 -0.040007 0.064644 0.041750 0.199134 -0.385912 -0.234799 0.185314 0.217596 0.225174 -0.431337 -0.203315 0.185525 0.246997 0.044088 -0.120542 0.044136 0.086940 0.198271 -0.371673 -0.223440 0.182615 0.203682 0.282060 -0.440275 -0.202026 0.183123 0.126117 0.067875 -0.061950 0.068551 0.046006 -0.047713 0.073509 0.027911 -0.140168 -0.190828 0.101564 0.071939 0.076748 0.244943 -0.438994 -0.188641 0.184295 0.165601 0.071176 -0.061276 0.014932 0.041199 0.019540 -0.083053 0.060271 -0.092122 0.092819 -0.084962 0.086953 -0.063822 0.058049 -0.094299 0.046024 0.290123 -0.514425 -0.163457 0.196161 0.152670 0.033802 0.080184 0.028291 -0.193113 0.058711 0.054923 0.049355 0.007521 0.033443 0.019565 -0.181072 0.038056 0.061910 0.053933 0.113873 -0.392334 -0.162247 0.149631 0.150784 0.041977 -0.059735 0.028006 0.043004 -0.024954 0.039277 0.046244 -0.054927 0.060048 0.040499 -0.051104 0.096193 0.110198 -0.021388 0.211642 0.238694 0.204913 0.219762 -0.388351 -0.170700 0.139753 0.165932 0.076732 -0.119338 0.083784 0.064968 0.315080 -0.349523 0.203035 -0.407341 -0.238562 0.181123 0.180761 0.052107 0.097478 0.029740 -0.178898 0.059821 0.042618 0.057038 -0.018251 0.033040 0.019933 -0.192240 0.062806 0.059869 0.015856 0.143665 -0.352990 -0.280948 0.215920 0.166079 0.055428 -0.014044 0.055521 0.050386 0.061028 -0.379832 0.065002 0.117261 -0.081053 0.183536 -0.105171 0.093615 0.200901 -0.424912 -0.087251 0.139826 0.134230 0.057915 0.121828 -0.002000 -0.220385 0.047178 0.040801 0.072730 -0.020039 0.038168 0.031981 -0.170082 0.055637 0.035602 0.061460 0.235676 -0.493489 -0.186576 0.148683 0.126229 0.052801 -0.019679 0.039720 0.033675 -0.077796 0.021332 0.041755 -0.045124 0.049352 0.057718 -0.025935 0.079666 0.084594 -0.044250 0.226468 0.194022 0.194239 0.252787 -0.401613 -0.246799 0.201859 0.126727 0.079553 0.038027 0.064077 0.015074 0.049902 -0.078035 0.048837 -0.086421 0.082295 -0.093436 0.080678 -0.106629 0.070376 -0.103465 0.051541 0.204969 -0.367573 -0.280386 0.208792 0.191433 0.068224 -0.005118 0.074441 0.010214 -0.021149 -0.353394 0.047281 0.100152 -0.088445 0.188713 -0.013474 0.105765 0.141796 -0.366308 -0.165643 0.162910 0.209818 0.051111 -0.107689 0.068877 0.082247 -0.042549 0.032842 0.087023 0.261428 -0.350029 0.213573 -0.286810 0.223770 0.217170 0.242272 -0.280192 0.233350 -0.206035 0.209441 -0.221997 0.234481
qa: 0.0165 0.0259 0.0927 0.0844 0.0618 -0.1163 0.0762 0.0196 0.0977 -0.3300 0.2152 0.2027 -0.3796 -0.1433 0.1537 0.1440 0.0692 -0.0400 0.0646 0.0417 0.1991 -0.3859 -0.2348 0.1853 0.2176 0.2252 -0.4313 -0.2033 0.1855 0.2470 0.0441 -0.1205 0.0441 0.0869 0.1983 -0.3717 -0.2234 0.1826 0.2037 0.2821 -0.4403 -0.2020 0.1831 0.1261 0.0679 -0.0620 0.0686 0.0460 -0.0477 0.0735 0.0279 -0.1402 -0.1908 0.1016 0.0719 0.0767 0.2449 -0.4390 -0.1886 0.1843 0.1656 0.0712 -0.0613 0.0149 0.0412 0.0195 -0.0831 0.0603 -0.0921 0.0928 -0.0850 0.0870 -0.0638 0.0580 -0.0943 0.0460 0.2901 -0.5144 -0.1635 0.1962 0.1527 0.0338 0.0802 0.0283 -0.1931 0.0587 0.0549 0.0494 0.0075 0.0334 0.0196 -0.1811 0.0381 0.0619 0.0539 0.1139 -0.3923 -0.1622 0.1496 0.1508 0.0420 -0.0597 0.0280 0.0430 -0.0250 0.0393 0.0462 -0.0549 0.0600 0.0405 -0.0511 0.0962 0.1102 -0.0214 0.2116 0.2387 0.2049 0.2198 -0.3884 -0.1707 0.1398 0.1659 0.0767 -0.1193 0.0838 0.0650 0.3151 -0.3495 0.2030 -0.4073 -0.2386 0.1811 0.1808 0.0521 0.0975 0.0297 -0.1789 0.0598 0.0426 0.0570 -0.0183 0.0330 0.0199 -0.1922 0.0628 0.0599 0.0159 0.1437 -0.3530 -0.2809 0.2159 0.1661 0.0554 -0.0140 0.0555 0.0504 0.0610 -0.3798 0.0650 0.1173 -0.0811 0.1835 -0.1052 0.0936 0.2009 -0.4249 -0.0873 0.1398 0.1342 0.0579 0.1218 -0.0020 -0.2204 0.0472 0.0408 0.0727 -0.0200 0.0382 0.0320 -0.1701 0.0556 0.0356 0.0615 0.2357 -0.4935 -0.1866 0.1487 0.1262 0.0528 -0.0197 0.0397 0.0337 -0.0778 0.0213 0.0418 -0.0451 0.0494 0.0577 -0.0259 0.0797 0.0846 -0.0443 0.2265 0.1940 0.1942 0.2528 -0.4016 -0.2468 0.2019 0.1267 0.0796 0.0380 0.0641 0.0151 0.0499 -0.0780 0.0488 -0.0864 0.0823 -0.0934 0.0807 -0.1066 0.0704 -0.1035 0.0515 0.2050 -0.3676 -0.2804 0.2088 0.1914 0.0682 -0.0051 0.0744 0.0102 -0.0211 -0.3534 0.0473 0.1002 -0.0884 0.1887 -0.0135 0.1058 0.1418 -0.3663 -0.1656 0.1629 0.2098 0.0511 -0.1077 0.0689 0.0822 -0.0425 0.0328 0.0870 0.2614 -0.3500 0.2136 -0.2868 0.2238 0.2172 0.2423 -0.2802 0.2333 -0.2060 0.2094 -0.2220 0.2345
va: 3.7078 3.8572 1.0335 4.0201 0.9900 3.9700 1.0107 1.0330 1.0196 2.0943 1.0353 4.2200 2.1222 3.3588 1.0656 3.8989 1.0502 3.9067 1.0400 1.0357 4.2321 2.0711 3.2684 1.0112 1.0033 4.2000 2.0528 3.3573 1.0336 3.8496 1.0606 3.8846 1.0397 1.0308 4.2891 2.1294 3.2213 1.0118 1.0122 4.1598 2.0766 3.3230 1.0485 3.9831 1.0265 3.9503 1.0252 1.0274 4.0646 1.0354 1.0273 2.2191 4.0014 1.0102 1.0060 1.0056 4.1569 2.0539 3.3174 1.0507 3.8548 1.0275 3.8739 1.0056 1.0265 3.6994 3.9810 1.0162 4.0315 1.0038 3.9010 1.0028 3.9396 1.0303 3.9997 1.0307 4.1336 1.9935 3.3918 1.0661 3.8123 1.0416 3.9359 1.0265 3.9833 1.0125 1.0196 1.0217 3.9377 1.0144 1.0419 3.9749 1.0152 1.0092 1.0132 4.2948 2.1243 3.2644 1.0557 3.8974 1.0537 3.9483 1.0528 1.0457 3.8596 1.0666 1.0310 3.9439 1.0194 1.0226 3.9056 1.0095 1.0050 3.6690 0.9898 1.0702 0.9932 4.2601 2.1014 3.3075 1.0381 3.8337 1.0331 3.9103 1.0222 1.0252 4.1468 2.0771 4.2664 2.1042 3.2925 1.0197 3.8313 1.0572 4.0009 1.0356 3.9804 1.0091 1.0220 1.0255 4.0005 1.0097 1.0445 3.9872 1.0104 1.0178 1.0279 4.3199 2.1661 3.2291 1.0105 3.8725 1.0194 3.9195 1.0493 1.0232 3.8525 3.0179 4.0112 1.0046 3.4380 1.0389 3.9854 1.0239 4.2543 2.0728 3.3918 1.0432 3.8638 1.0263 3.8144 1.0264 4.0149 1.0224 1.0270 1.0252 3.9425 1.0292 1.0169 3.9595 1.0094 1.0147 1.0150 4.1099 1.9971 3.3367 1.0671 3.9684 1.0447 3.9030 1.0467 1.0333 3.9037 1.0527 1.0225 3.9338 1.0123 1.0458 3.9426 1.0095 1.0132 3.5934 1.0860 1.0670 1.0267 4.2140 2.0998 3.2514 1.0373 3.8539 1.0423 3.8586 1.0260 1.0437 3.7046 3.9455 1.0231 3.9685 1.0037 3.9373 1.0034 3.9196 1.0067 3.9478 1.0187 4.2226 2.1425 3.2072 1.0075 3.8655 1.0520 3.9540 1.0314 1.0387 3.9047 3.0119 3.9732 1.0142 3.4834 1.0047 3.9711 1.0219 4.3858 2.1610 3.2954 1.0711 3.8663 1.0545 3.9919 1.0247 1.0251 3.8852 1.0255 1.0102 4.2100 2.1151 4.3061 2.1861 1.0108 1.0003 0.9707 2.1904 1.0278 2.2343 1.0332 2.2075 1.0250
dispcorr: -0.499633421 hartree
energy: -6748.957367726201
dipole: 1.28030 -16.59323 -15.31293 87.35896 -55.27240 32.08655 -12.86302 12.92085 0.05784
magnitude: 35.55329 au
magnitude: 90.36927 debye
