program: Orca
programVersion: 5.0.2
elementType: N C H C H C H H H C H H C H H H C O N C H H C H H C H H C H C O N H C H C H H H C O N H C H C H C H H H C H H C H H H C O N H C H C H H H C O N H C H H C O N H C H C H H H C O N H C H C H C H H H C H H C H H H C O N H C H H C O N H C H H C O N H C H C H H C H C H H H C H H H C O N H C H C H C H H H C H H C H H H C O N H C H C H H C H H C H H N H C N H H N H H C O N H C H C H H C H H C H H C H H N H H H O H H H C O H
charge: 3
multiplicity: 1
keywords: TPSS D3BJ def2-TZVPP def2/J
keywords: PAL8 defgrid2 XYZFILE CHELPG
formula: C62H115N18O15
InChI: InChI=1S/C62H115N18O15/c1-14-33(7)47(64)60(93)80-27-21-24-43(80)56(89)72-39(13)53(86)78-49(35(9)16-3)58(91)73-37(11)51(84)69-31-45(82)71-38(12)52(85)77-48(34(8)15-2)57(90)70-29-44(81)68-30-46(83)74-42(28-32(5)6)55(88)79-50(36(10)17-4)59(92)75-40(23-20-26-67-62(65)66)54(87)76-41(61(94)95)22-18-19-25-63/h32-43,47-50,67-79,94H,14-31,65-66H2,1-13,63-64H3
210 atoms
N  0.234567 -11.856128 0.366511
C  0.403697 -10.748189 -0.573786
H  1.386509 -10.327247 -0.384688
C  0.400199 -11.257166 -2.037565
H  -0.588737 -11.663791 -2.253691
C  0.643963 -10.102181 -3.030676
H  0.729332 -10.495987 -4.043311
H  -0.192104 -9.402666 -3.011707
H  1.556501 -9.564975 -2.77421
C  1.420962 -12.392494 -2.295634
H  1.339069 -12.704985 -3.337481
H  1.151737 -13.257332 -1.68853
C  2.891704 -12.049367 -2.013413
H  3.510228 -12.91847 -2.239194
H  3.216879 -11.220948 -2.641016
H  3.027207 -11.78994 -0.963316
C  -0.60701 -9.596957 -0.356336
O  -0.188592 -8.431296 -0.415415
N  -1.904782 -9.838838 -0.04132
C  -2.588986 -11.12743 -0.002863
H  -2.333194 -11.645594 0.921692
H  -2.334837 -11.748759 -0.860437
C  -4.082774 -10.816604 -0.006575
H  -4.658754 -11.583858 0.511644
H  -4.431902 -10.699367 -1.032927
C  -4.146072 -9.472093 0.712955
H  -4.106353 -9.636582 1.790153
H  -5.041673 -8.911303 0.444355
C  -2.871576 -8.771855 0.23166
H  -3.088502 -8.267649 -0.71124
C  -2.395234 -7.709413 1.236226
O  -2.653456 -6.520781 1.046413
N  -1.644934 -8.119401 2.265873
H  -1.45653 -9.105988 2.35306
C  -1.061986 -7.212156 3.254723
H  -1.868935 -6.640688 3.715654
C  -0.391199 -8.056554 4.344773
H  0.018885 -7.399356 5.112179
H  -1.12531 -8.71792 4.804991
H  0.416559 -8.653005 3.919116
C  -0.07614 -6.191053 2.645576
O  -0.172885 -4.993463 2.929725
N  0.845699 -6.637444 1.779779
H  0.802154 -7.597972 1.470363
C  1.820281 -5.739127 1.142072
H  2.141412 -5.02961 1.903068
C  3.102483 -6.486446 0.686211
H  3.557712 -6.90984 1.583109
C  2.824645 -7.66374 -0.257563
H  3.761386 -8.119802 -0.577219
H  2.258118 -8.424788 0.271384
H  2.275736 -7.333185 -1.138718
C  4.161509 -5.576054 0.029182
H  3.752932 -5.103058 -0.864073
H  5.012173 -6.18548 -0.282021
C  4.711541 -4.486158 0.961409
H  5.496615 -3.933671 0.444143
H  3.92222 -3.79108 1.241519
H  5.128541 -4.944028 1.858437
C  1.16288 -4.895395 0.042569
O  1.496721 -3.723349 -0.086794
N  0.158795 -5.414367 -0.674427
H  -0.095054 -6.388063 -0.543515
C  -0.630928 -4.580103 -1.589021
H  0.047222 -4.124972 -2.312924
C  -1.599356 -5.494801 -2.349819
H  -2.158739 -4.907594 -3.079408
H  -1.041246 -6.270895 -2.874821
H  -2.298112 -5.9627 -1.656204
C  -1.368923 -3.430929 -0.869857
O  -1.344412 -2.291375 -1.339527
N  -1.963096 -3.701904 0.300068
H  -1.987539 -4.665833 0.619413
C  -2.580711 -2.670986 1.14217
H  -3.034705 -3.153203 2.006722
H  -3.360077 -2.161284 0.576428
C  -1.576973 -1.627782 1.643704
O  -1.808627 -0.428282 1.494659
N  -0.434417 -2.076287 2.179294
H  -0.306112 -3.077339 2.295374
C  0.627289 -1.18451 2.654155
H  0.216149 -0.548757 3.440207
C  1.737198 -2.044176 3.26568
H  2.525709 -1.403471 3.658903
H  1.332619 -2.646902 4.080066
H  2.161859 -2.705474 2.511575
C  1.178126 -0.252309 1.556523
O  1.283145 0.956106 1.766691
N  1.466964 -0.791242 0.367268
H  1.371073 -1.79761 0.261463
C  1.904424 -0.012735 -0.798518
H  2.765407 0.588463 -0.509127
C  2.343053 -0.95645 -1.947388
H  1.540771 -1.679144 -2.103101
C  2.541212 -0.211297 -3.282222
H  2.951661 -0.892913 -4.026777
H  1.58669 0.153244 -3.659776
H  3.217719 0.633344 -3.157067
C  3.622982 -1.749757 -1.593153
H  3.781097 -2.511834 -2.355603
H  3.475125 -2.272208 -0.651191
C  4.920351 -0.939183 -1.459257
H  5.734555 -1.611853 -1.189077
H  5.166937 -0.457045 -2.404872
H  4.820624 -0.187797 -0.677479
C  0.824655 0.980732 -1.241183
O  1.128589 2.148469 -1.453738
N  -0.445566 0.567559 -1.310692
H  -0.648214 -0.414337 -1.136638
C  -1.553415 1.447992 -1.702644
H  -2.445293 0.830696 -1.800764
H  -1.335255 1.887765 -2.673361
C  -1.869395 2.564748 -0.704457
O  -2.409381 3.593853 -1.11043
N  -1.544702 2.397589 0.580547
H  -1.20523 1.480815 0.858956
C  -1.712981 3.41193 1.629655
H  -1.887255 2.893191 2.572242
H  -2.584314 4.03002 1.416134
C  -0.495988 4.31923 1.817568
O  -0.632254 5.459057 2.268581
N  0.695013 3.853672 1.433795
H  0.770055 2.868953 1.189069
C  1.884013 4.683906 1.261164
H  2.00721 5.297098 2.148104
C  3.112695 3.75792 1.130327
H  3.031495 3.158849 0.22263
H  3.092045 3.057263 1.966351
C  4.513278 4.412673 1.147274
H  5.235914 3.599127 1.215846
C  4.856992 5.218196 -0.105981
H  5.918266 5.464995 -0.09435
H  4.653296 4.623741 -0.996206
H  4.291074 6.147598 -0.148987
C  4.7096 5.31158 2.368964
H  5.756432 5.613716 2.423945
H  4.096759 6.208735 2.290982
H  4.465297 4.762985 3.27775
C  1.697189 5.622129 0.063101
O  1.661966 6.837237 0.23881
N  1.515702 5.049636 -1.132233
H  1.510511 4.033763 -1.172088
C  1.560892 5.764274 -2.412203
H  2.518192 6.282712 -2.43059
C  1.537145 4.76882 -3.596823
H  2.214115 3.946427 -3.357986
C  0.140768 4.164158 -3.822907
H  0.21953 3.308691 -4.495234
H  -0.272094 3.828344 -2.876473
H  -0.530729 4.897359 -4.267102
C  2.020785 5.379687 -4.931981
H  1.395841 6.232568 -5.194501
H  1.908594 4.629581 -5.715199
C  3.489223 5.820669 -4.921621
H  3.783672 6.110678 -5.928941
H  3.627713 6.675004 -4.263266
H  4.121909 4.998816 -4.592992
C  0.490843 6.854523 -2.538937
O  0.767603 7.925535 -3.069506
N  -0.712615 6.639127 -1.982226
H  -0.883227 5.733768 -1.567957
C  -1.795272 7.640801 -2.007174
H  -1.777906 8.093656 -3.001647
C  -3.176452 6.972915 -1.855773
H  -3.195431 6.072792 -2.474111
H  -3.922425 7.657849 -2.261968
C  -3.590479 6.627452 -0.411972
H  -3.626097 7.53502 0.187346
H  -2.86178 5.951959 0.033625
C  -4.990378 5.990803 -0.373163
H  -5.688249 6.664982 -0.871171
H  -5.293663 5.884209 0.669121
N  -4.996996 4.664936 -1.016141
H  -4.094557 4.206044 -1.066614
C  -6.004123 4.034532 -1.587317
N  -7.203961 4.538109 -1.64895
H  -7.363425 5.440705 -1.24009
H  -7.949981 4.042592 -2.097063
N  -5.813687 2.862407 -2.120137
H  -4.89673 2.461228 -2.088535
H  -6.563357 2.379434 -2.576207
C  -1.606548 8.832807 -1.051732
O  -2.517011 9.642438 -0.907965
N  -0.484349 8.889097 -0.326242
H  0.222468 8.18953 -0.527695
C  -0.278968 9.759429 0.843223
H  -0.719454 10.739414 0.646342
C  -1.030513 9.091043 2.012633
H  -0.720228 8.050771 2.050132
H  -2.095729 9.071863 1.775754
C  -0.889574 9.737587 3.406296
H  -1.711662 10.444184 3.529185
H  0.037702 10.29995 3.499597
C  -0.957574 8.687723 4.532032
H  -1.712344 7.937016 4.288486
H  -1.29213 9.194544 5.4390
C  0.380539 8.002475 4.860656
H  0.20542 7.281096 5.662096
H  1.075233 8.757514 5.240019
N  1.003978 7.3059 3.706735
H  0.345803 6.6797 3.241903
H  1.319949 7.985499 3.013858
H  1.812267 6.771125 3.983258
O  2.129069 9.478174 0.40176
H  0.804618 -11.698893 1.172934
H  -0.724681 -11.915365 0.642794
H  0.508158 -12.711445 -0.073466
C  1.229777 9.967532 1.085528
O  1.815331 10.637669 1.975255
H  1.931267 11.541033 1.671786
totalener: -4547.64767801 hartree
kineticenergy: 4529.91764224 hartree
exchangeener: -610.273992520891 hartree
correlationener: -24.598147277617 hartree
xcener: -634.872139798508 hartree
chargesum: 3.0000000
charge: 0.029128 -0.075322 0.104819 0.064519 0.048497 -0.179451 0.084680 0.062683 0.073169 -0.040005 0.071697 0.016610 -0.146745 0.093630 0.078457 0.021589 0.256110 -0.451750 -0.139370 -0.069341 0.046235 0.107411 -0.022284 0.077866 0.068283 -0.079585 0.053723 0.084769 0.168916 0.076700 0.200994 -0.401826 -0.183830 0.114586 0.156838 0.066532 -0.176475 0.093502 0.084860 0.033076 0.245493 -0.424952 -0.220931 0.137490 0.170753 0.073769 0.125486 0.011435 -0.215373 0.073313 0.004347 0.059662 -0.051148 0.034988 0.042715 -0.162390 0.062213 0.050944 0.054024 0.239639 -0.484641 -0.246420 0.227030 0.186929 0.055927 -0.214362 0.081423 0.067649 0.058367 0.230460 -0.441029 -0.224949 0.242001 0.050281 0.078131 0.061121 0.213935 -0.437268 -0.219236 0.227145 0.198676 0.043220 -0.181214 0.073742 0.073370 0.046376 0.203392 -0.453409 -0.256602 0.255725 0.170005 0.047209 0.114322 0.006848 -0.191145 0.055490 0.047665 0.068376 0.003591 0.015661 0.012907 -0.174874 0.054118 0.058210 0.039827 0.209679 -0.486577 -0.227279 0.258698 0.019969 0.061990 0.099631 0.278856 -0.525057 -0.171763 0.238254 0.058317 0.088674 0.062976 0.238613 -0.475229 -0.162298 0.224061 0.050689 0.001152 -0.026113 0.027769 0.054283 0.119395 0.008838 -0.171561 0.062297 0.037970 0.060569 -0.204770 0.068263 0.027201 0.043604 0.296924 -0.461971 -0.279290 0.241975 0.153239 0.052065 0.165516 -0.008027 -0.206145 0.046771 0.036767 0.057761 -0.026707 0.035947 0.029360 -0.176312 0.059305 0.064644 0.033622 0.080164 -0.330320 -0.238932 0.166871 0.231911 0.052987 -0.073396 0.040440 0.066081 -0.052158 0.056981 0.052729 -0.058349 0.074733 0.092940 -0.196536 0.243803 0.305332 -0.224963 0.208094 0.201037 -0.229095 0.195481 0.195173 0.110969 -0.383785 -0.204200 0.274890 0.230074 0.064379 -0.202306 0.068521 0.065661 -0.061054 0.065958 0.036290 -0.074196 0.052612 0.072449 -0.038862 0.095931 0.107007 -0.027654 0.244820 0.219160 0.195361 -0.243493 0.226334 0.190505 0.214212 0.152040 -0.245179 0.236656
charge: 0.664033 -0.049772 0.037987 -0.072887 0.022920 0.053567 0.029847 0.014583 0.018452 -0.008135 0.040245 0.001342 0.035113 0.028598 0.018527 -0.004879 -0.387750 0.120016 0.289899 -0.038269 0.007105 0.018011 0.028057 0.034937 0.033840 0.028610 0.025982 0.039890 -0.076149 0.042292 -0.391510 0.105131 0.347191 -0.036484 -0.095412 0.041837 0.039625 0.034908 0.017624 0.001665 -0.387337 0.090837 0.355169 -0.044971 -0.074596 0.041604 -0.065445 0.026008 0.014582 0.016664 -0.018742 0.009956 -0.009403 0.015745 0.022279 0.021478 0.014737 -0.002914 0.009061 -0.398942 0.114623 0.351232 -0.041733 -0.095845 0.036000 0.031129 0.025636 0.010777 0.005677 -0.392391 0.074702 0.344651 -0.042670 -0.016449 0.028421 0.027597 -0.403417 0.067418 0.349664 -0.037412 -0.096921 0.033123 0.033948 0.022732 0.016992 0.004201 -0.397756 0.070522 0.360350 -0.042308 -0.078371 0.035128 -0.069975 0.018731 0.035941 0.017000 0.008610 0.014054 -0.022160 0.014036 0.005723 0.022513 0.009230 0.009398 0.002149 -0.406887 0.100311 0.351693 -0.036940 -0.019432 0.025721 0.032424 -0.403595 0.081242 0.360142 -0.029115 -0.010228 0.034720 0.025249 -0.391456 0.074407 0.367348 -0.029315 -0.093521 0.014725 -0.000439 0.016171 0.023801 -0.088350 0.023091 0.026300 0.016275 0.005842 0.015142 0.016958 0.020801 -0.000326 0.002361 -0.413285 0.094815 0.357280 -0.046541 -0.079815 0.039789 -0.068209 0.020036 0.015010 0.009449 -0.008447 0.010631 -0.009144 0.018905 0.016332 0.021577 0.012417 0.006443 0.001360 -0.416332 0.107039 0.341316 -0.033476 -0.077844 0.043252 -0.000462 0.015325 0.029887 -0.004671 0.026444 0.008728 -0.019389 0.018866 0.016837 0.371550 -0.068101 -0.338538 0.424558 -0.005351 -0.003566 0.416867 -0.008308 -0.007406 -0.406395 0.074572 0.365111 -0.032183 -0.077540 0.041579 -0.016660 0.007326 0.028495 -0.007002 0.026184 0.007140 -0.007202 0.021607 0.034625 0.015039 0.027343 0.031510 0.610732 -0.019534 0.055416 0.034929 0.140607 0.050382 0.001865 0.035455 -0.504032 0.419957 -0.081132
qa: 0.0291 -0.0753 0.1048 0.0645 0.0485 -0.1795 0.0847 0.0627 0.0732 -0.0400 0.0717 0.0166 -0.1467 0.0936 0.0785 0.0216 0.2561 -0.4517 -0.1394 -0.0693 0.0462 0.1074 -0.0223 0.0779 0.0683 -0.0796 0.0537 0.0848 0.1689 0.0767 0.2010 -0.4018 -0.1838 0.1146 0.1568 0.0665 -0.1765 0.0935 0.0849 0.0331 0.2455 -0.4250 -0.2209 0.1375 0.1708 0.0738 0.1255 0.0114 -0.2154 0.0733 0.0043 0.0597 -0.0511 0.0350 0.0427 -0.1624 0.0622 0.0509 0.0540 0.2396 -0.4846 -0.2464 0.2270 0.1869 0.0559 -0.2144 0.0814 0.0676 0.0584 0.2305 -0.4410 -0.2249 0.2420 0.0503 0.0781 0.0611 0.2139 -0.4373 -0.2192 0.2271 0.1987 0.0432 -0.1812 0.0737 0.0734 0.0464 0.2034 -0.4534 -0.2566 0.2557 0.1700 0.0472 0.1143 0.0068 -0.1911 0.0555 0.0477 0.0684 0.0036 0.0157 0.0129 -0.1749 0.0541 0.0582 0.0398 0.2097 -0.4866 -0.2273 0.2587 0.0200 0.0620 0.0996 0.2789 -0.5251 -0.1718 0.2383 0.0583 0.0887 0.0630 0.2386 -0.4752 -0.1623 0.2241 0.0507 0.0012 -0.0261 0.0278 0.0543 0.1194 0.0088 -0.1716 0.0623 0.0380 0.0606 -0.2048 0.0683 0.0272 0.0436 0.2969 -0.4620 -0.2793 0.2420 0.1532 0.0521 0.1655 -0.0080 -0.2061 0.0468 0.0368 0.0578 -0.0267 0.0359 0.0294 -0.1763 0.0593 0.0646 0.0336 0.0802 -0.3303 -0.2389 0.1669 0.2319 0.0530 -0.0734 0.0404 0.0661 -0.0522 0.0570 0.0527 -0.0583 0.0747 0.0929 -0.1965 0.2438 0.3053 -0.2250 0.2081 0.2010 -0.2291 0.1955 0.1952 0.1110 -0.3838 -0.2042 0.2749 0.2301 0.0644 -0.2023 0.0685 0.0657 -0.0611 0.0660 0.0363 -0.0742 0.0526 0.0724 -0.0389 0.0959 0.1070 -0.0277 0.2448 0.2192 0.1954 -0.2435 0.2263 0.1905 0.2142 0.1520 -0.2452 0.2367
va: 3.6457 4.0076 1.0349 3.9545 1.0193 4.0175 1.0104 1.0171 1.0197 3.9573 1.0133 1.0196 3.9777 1.0096 1.0162 1.0133 4.0992 2.0200 3.2640 4.0028 1.0058 1.0020 4.0078 1.0137 1.0196 4.0355 1.0270 1.0176 3.8740 1.0371 4.2327 2.1060 3.2874 1.0567 3.8878 1.0377 3.9599 1.0191 1.0086 1.0162 4.1510 2.0754 3.2463 1.0623 3.9409 1.0390 3.9322 1.0161 3.9672 1.0130 1.0222 1.0318 3.9934 1.0209 1.0084 3.9891 1.0162 1.0303 1.0104 4.1036 2.0025 3.2655 0.9944 3.8675 1.0389 3.9768 1.0163 1.0129 1.0322 4.1932 2.0710 3.2550 0.9947 3.8934 1.0145 1.0385 4.2269 2.0730 3.2355 1.0137 3.8627 1.0406 3.9689 1.0152 1.0196 1.0493 4.2095 2.0360 3.2247 0.9883 3.9036 1.0459 3.9937 1.0505 4.0010 1.0078 1.0165 1.0186 3.9723 1.0104 1.0294 3.9775 1.0115 1.0127 1.0175 4.0503 1.9814 3.2543 0.9858 3.9851 1.0140 1.0235 4.0436 1.9501 3.2689 1.0080 3.9122 1.0094 1.0474 4.1751 2.0439 3.2478 1.0225 4.1273 1.0192 3.9827 1.0530 1.0322 3.9107 1.0085 4.0040 1.0101 1.0189 1.0320 3.9674 1.0202 1.0282 1.0058 4.0076 2.0136 3.2714 0.9882 3.8765 1.0670 3.9207 1.0332 4.0044 1.0139 1.0230 1.0240 3.9496 1.0266 1.0042 3.9757 1.0097 1.0219 1.0124 4.3566 2.1859 3.2451 1.0162 3.8291 1.0482 3.9570 1.0358 1.0262 3.9569 1.0446 1.0416 3.9151 1.0109 1.0005 3.3132 1.0321 4.2531 3.3618 1.0080 1.0079 3.3201 1.0231 1.0102 4.3915 2.1403 3.2676 0.9479 3.7690 1.0343 4.0057 1.0252 1.0366 3.8729 1.0127 1.0712 3.9551 1.0241 1.0123 3.9238 1.0056 1.0084 3.6842 1.0540 1.0025 0.9999 2.1452 0.9810 1.0453 1.0154 4.3750 2.1428 1.0318
dispcorr: -0.403261173 hartree
energy: -4548.050939179225
dipole: 47.20066 -54.21300 -7.01234 -77.46178 57.34990 -20.11188 -13.02295 16.73045 3.70750
magnitude: 21.61958 au
magnitude: 54.95261 debye
