program: Orca
programVersion: 5.0.3
elementType: C C C N C C C C C O C C C C C C C C C C O H H H H H H H H H H H H H H H H H H H H H H H H H H H H H H H H H H H H
charge: 1
multiplicity: 1
keywords: wB97X-D3 TightOpt Freq def2-TZVPP def2/J RIJCOSX TightSCF defgrid3 CHELPG
frequency: 0.00 0.00 0.00 0.00 0.00 0.00 21.81 23.68 41.55 52.87 61.51 71.98 79.76 105.21 118.25 158.12 173.49 185.93 222.40 236.69 239.20 245.63 270.92 278.64 285.99 297.10 308.92 334.47 338.45 342.32 357.33 363.79 388.33 410.93 416.39 430.64 438.52 463.73 490.74 501.14 522.06 552.29 585.17 643.36 670.09 737.67 758.76 765.60 783.06 798.08 809.56 834.99 842.63 873.83 906.54 915.89 933.48 937.15 944.75 949.84 952.77 962.11 968.75 981.05 987.34 997.36 1011.38 1033.76 1038.48 1049.21 1067.77 1076.22 1076.88 1083.54 1095.53 1116.38 1127.20 1132.67 1143.46 1161.86 1163.77 1176.46 1186.44 1204.72 1216.79 1238.16 1252.40 1260.68 1262.10 1271.82 1290.86 1295.25 1313.30 1328.89 1339.43 1346.44 1348.98 1357.86 1365.01 1371.00 1376.77 1385.58 1390.81 1393.89 1405.02 1411.74 1413.56 1415.90 1417.03 1422.83 1432.28 1438.24 1440.13 1444.23 1459.55 1479.05 1486.05 1490.32 1492.65 1493.36 1495.92 1497.84 1498.74 1503.80 1504.42 1506.44 1508.23 1511.23 1512.02 1520.14 1522.39 1522.95 1527.60 1529.22 1530.36 3048.95 3050.74 3053.20 3054.55 3057.41 3058.99 3068.67 3070.07 3072.10 3077.80 3080.15 3083.64 3101.10 3103.15 3105.89 3108.08 3109.79 3118.58 3124.12 3125.02 3127.50 3128.68 3131.52 3133.59 3137.82 3138.19 3142.60 3144.22 3146.57 3151.45 3159.61 3162.63 3165.29 3170.96 3171.41 3332.16
frequency: 21.81 23.68 41.55 52.87 61.51 71.98 79.76 105.21 118.25 158.12 173.49 185.93 222.40 236.69 239.20 245.63 270.92 278.64 285.99 297.10 308.92 334.47 338.45 342.32 357.33 363.79 388.33 410.93 416.39 430.64 438.52 463.73 490.74 501.14 522.06 552.29 585.17 643.36 670.09 737.67 758.76 765.60 783.06 798.08 809.56 834.99 842.63 873.83 906.54 915.89 933.48 937.15 944.75 949.84 952.77 962.11 968.75 981.05 987.34 997.36 1011.38 1033.76 1038.48 1049.21 1067.77 1076.22 1076.88 1083.54 1095.53 1116.38 1127.20 1132.67 1143.46 1161.86 1163.77 1176.46 1186.44 1204.72 1216.79 1238.16 1252.40 1260.68 1262.10 1271.82 1290.86 1295.25 1313.30 1328.89 1339.43 1346.44 1348.98 1357.86 1365.01 1371.00 1376.77 1385.58 1390.81 1393.89 1405.02 1411.74 1413.56 1415.90 1417.03 1422.83 1432.28 1438.24 1440.13 1444.23 1459.55 1479.05 1486.05 1490.32 1492.65 1493.36 1495.92 1497.84 1498.74 1503.80 1504.42 1506.44 1508.23 1511.23 1512.02 1520.14 1522.39 1522.95 1527.60 1529.22 1530.36 3048.95 3050.74 3053.20 3054.55 3057.41 3058.99 3068.67 3070.07 3072.10 3077.80 3080.15 3083.64 3101.10 3103.15 3105.89 3108.08 3109.79 3118.58 3124.12 3125.02 3127.50 3128.68 3131.52 3133.59 3137.82 3138.19 3142.60 3144.22 3146.57 3151.45 3159.61 3162.63 3165.29 3170.96 3171.41 3332.16
formula: C18H36NO2
InChI: InChI=1S/C18H36NO2/c1-6-12-19(7-2)13-16-14-20-18(21-16)10-8-15(9-11-18)17(3,4)5/h15-16,19H,6-14H2,1-5H3
57 atoms
C  -4.857272 2.50731 -1.779613
C  -4.064403 2.03619 -0.565908
C  -3.870236 0.531309 -0.607106
N  -2.925043 0.025075 0.43995
C  -3.329434 0.331462 1.851865
C  -4.639852 -0.303913 2.263012
C  -2.57308 -1.411299 0.230923
C  -1.533788 -1.512262 -0.893186
C  -0.609291 -2.710869 -0.697675
O  0.366317 -2.178788 0.164808
C  0.618736 -0.856187 -0.258767
C  1.664138 -0.785219 -1.356875
C  3.039737 -1.162979 -0.813443
C  3.510896 -0.33211 0.392219
C  2.401377 -0.336704 1.46009
C  1.000035 -0.010122 0.935223
C  4.153287 1.062042 0.098299
C  3.152359 2.197659 -0.147395
C  5.010914 1.450321 1.311217
C  5.082379 0.966977 -1.116584
O  -0.661459 -0.405546 -0.785064
H  -5.009881 3.584015 -1.74079
H  -5.839922 2.035318 -1.819357
H  -4.333907 2.278405 -2.708627
H  -4.588427 2.3293 0.345537
H  -3.087622 2.528908 -0.549073
H  -3.442317 0.238657 -1.565454
H  -4.811288 -0.003815 -0.484407
H  -3.36887 1.415137 1.939571
H  -2.507668 -0.018884 2.475818
H  -5.484858 0.083558 1.69533
H  -4.820749 -0.07145 3.311108
H  -4.62039 -1.389447 2.169792
H  -3.475813 -1.979418 0.015069
H  -2.131862 -1.770077 1.160676
H  -2.003538 -1.503156 -1.877309
H  -0.185046 -3.036407 -1.650544
H  -1.080462 -3.562969 -0.210198
H  1.655059 0.226728 -1.763018
H  1.382671 -1.450331 -2.17578
H  3.769602 -1.131493 -1.619758
H  2.99336 -2.207283 -0.4935
H  4.335842 -0.908364 0.821797
H  2.640435 0.348554 2.273816
H  2.364989 -1.333351 1.906011
H  0.930208 1.032528 0.626222
H  0.261278 -0.175731 1.725103
H  2.549501 2.407615 0.737658
H  2.48334 1.996391 -0.985091
H  3.693382 3.114995 -0.385647
H  4.423078 1.519606 2.227917
H  5.479053 2.423113 1.152999
H  5.806859 0.722419 1.478662
H  4.530085 0.849123 -2.050251
H  5.776752 0.128921 -1.025161
H  5.676391 1.877636 -1.205883
H  -2.02407 0.493168 0.267356
totalener: -912.68814177 hartree
nucrepener: 1929.27382445 hartree
electener: -2841.96196622 hartree
oneelecener: -5050.66723504 hartree
twoeener: 2208.70526882 hartree
kineticenergy: 907.52460149 hartree
xcener: -92.020172831690 hartree
chargesum: 1.0000000
charge: -0.248316 -0.108695 -0.166026 0.187979 -0.116024 -0.239247 -0.333131 0.194471 -0.024106 -0.326289 0.537005 -0.257270 -0.218869 0.029563 -0.263779 -0.286131 0.193911 -0.342987 -0.312571 -0.324691 -0.395745 0.108284 0.090100 0.089602 0.080059 0.088660 0.139644 0.132491 0.138886 0.124768 0.099333 0.123197 0.104931 0.144685 0.162882 0.113149 0.098396 0.109530 0.103397 0.081116 0.102847 0.111315 0.076297 0.097763 0.113809 0.103516 0.074607 0.080971 0.087731 0.109138 0.088075 0.094785 0.096204 0.082717 0.103554 0.098810 0.165696
charge: 0.023167 -0.038419 0.000603 0.448606 -0.006542 0.025707 0.009118 -0.183261 -0.092921 0.264021 -0.332699 -0.011318 -0.002161 -0.056982 0.001138 -0.020675 -0.173051 0.013988 0.019185 0.016564 0.243233 0.024110 0.018951 0.018419 0.022146 0.026713 0.036207 0.031298 0.030041 0.030542 0.019229 0.035827 0.020684 0.034333 0.038246 0.023884 0.019006 0.027757 0.026528 0.024891 0.024054 0.029397 0.039733 0.022587 0.030183 0.025279 0.017777 0.011115 0.005367 0.023284 0.009997 0.019283 0.018332 0.011938 0.020396 0.021009 0.014155
qa: -0.2483 -0.1087 -0.1660 0.1880 -0.1160 -0.2392 -0.3331 0.1945 -0.0241 -0.3263 0.5370 -0.2573 -0.2189 0.0296 -0.2638 -0.2861 0.1939 -0.3430 -0.3126 -0.3247 -0.3957 0.1083 0.0901 0.0896 0.0801 0.0887 0.1396 0.1325 0.1389 0.1248 0.0993 0.1232 0.1049 0.1447 0.1629 0.1131 0.0984 0.1095 0.1034 0.0811 0.1028 0.1113 0.0763 0.0978 0.1138 0.1035 0.0746 0.0810 0.0877 0.1091 0.0881 0.0948 0.0962 0.0827 0.1036 0.0988 0.1657
va: 3.9749 3.8834 3.8463 3.5123 3.8370 3.9220 3.9780 3.8063 4.0597 2.0469 3.7646 4.0136 3.9310 3.7291 4.0243 3.9368 3.7885 3.9324 3.9351 3.9442 2.0086 1.0055 1.0010 1.0040 1.0071 1.0062 1.0003 0.9921 0.9872 1.0018 1.0027 1.0081 1.0031 1.0023 0.9860 0.9986 0.9999 0.9951 1.0192 1.0215 1.0096 1.0148 1.0139 1.0149 1.0095 1.0089 1.0310 0.9979 1.0033 1.0162 1.0078 1.0085 1.0071 0.9983 1.0036 1.0125 1.0469
dispcorr: -0.030850811 hartree
energy: -912.721419683660
dipole: -2.20108 -2.31245 -4.51353 11.48461 -11.63659 -0.15198 1.66753 -1.32177 0.34576
magnitude: 4.52930 au
magnitude: 11.51257 debye
temp: 298.15 k
press: 1.00 atm
zeropoint: 0.53484954 hartree
thermalvibcorrection: 0.02018136 hartree
thermalrotcorrection: 0.00141627 hartree
thermaltrasncorrection: 0.00141627 hartree
thermaltotal: -912.16355623 hartree
thermalcorr: 0.02301391 hartree
nonthermalcorr: 0.53484954 hartree
totalcorr: 0.55786345 hartree
thermalcorrenthalpy: 0.00094421 hartree
totalenthalpy: -912.16261203 hartree
totalentropycorr: -0.07229676 hartree
gibbsenthalpy: -912.23490879 hartree
gibbsminuselec: 0.48651090 hartree
