program: Orca
programVersion: 5.0.3
elementType: N C H C O O H H C H H H H H
charge: 1
multiplicity: 1
keywords: wB97X-D3 TightOpt Freq def2-TZVPP def2/J RIJCOSX TightSCF defgrid3 CHELPG
frequency: 0.00 0.00 0.00 0.00 0.00 0.00 58.34 111.37 192.62 285.13 366.13 503.09 531.06 598.82 672.74 793.86 900.62 906.85 997.31 1058.33 1144.51 1163.49 1213.17 1306.70 1352.67 1371.10 1438.97 1454.45 1469.34 1484.87 1505.73 1509.74 1641.67 1923.89 3102.41 3116.23 3185.90 3206.84 3210.60 3457.91 3524.22 3799.70
frequency: 58.34 111.37 192.62 285.13 366.13 503.09 531.06 598.82 672.74 793.86 900.62 906.85 997.31 1058.33 1144.51 1163.49 1213.17 1306.70 1352.67 1371.10 1438.97 1454.45 1469.34 1484.87 1505.73 1509.74 1641.67 1923.89 3102.41 3116.23 3185.90 3206.84 3210.60 3457.91 3524.22 3799.70
formula: C3H8NO2
InChI: InChI=1S/C3H8NO2/c1-4-2-3(5)6/h5H,2,4H2,1H3
14 atoms
N  -1.353684 -0.189894 -0.526236
C  -0.092177 -0.959333 -0.300177
H  0.139459 -1.520106 -1.205998
C  1.089875 -0.052914 0.007068
O  2.081864 -0.444904 0.523359
O  0.85803 1.197355 -0.422739
H  1.63909 1.744439 -0.265674
H  -0.239973 -1.659607 0.51828
C  -2.003135 0.306265 0.725806
H  -2.268006 -0.549183 1.341159
H  -1.299405 0.948305 1.247932
H  -2.893289 0.868871 0.457918
H  -1.128205 0.610658 -1.120678
H  -2.014015 -0.769126 -1.042384
totalener: -324.14319287 hartree
nucrepener: 257.02657758 hartree
electener: -581.16977046 hartree
oneelecener: -940.09766794 hartree
twoeener: 358.92789748 hartree
kineticenergy: 322.58994371 hartree
xcener: -29.798058481687 hartree
energy: -529.6739 -527.8441 -401.4810 -288.3772 -286.8314 -286.3248 -38.5118 -36.3229 -36.0076 -29.4673 -27.8802 -25.6094 -24.1751 -23.1553 -22.0755 -20.8705 -20.6082 -20.3470 -19.3046 -19.2498 -18.7632 -18.5513 -16.4212 -15.2098 -2.8073 -2.2535 -1.0690 -0.7309 -0.3763 -0.3093 -0.1813 0.5059 0.9471 0.9736 1.7349 2.0515 2.7757 2.9581 3.2574 4.0207 4.0844 4.5934 5.4418 5.7303 6.2710 6.9222 7.4162 7.6924 8.1336 8.3629 8.5292 8.7203 9.1731 9.5269 9.7131 9.8265 9.9634 10.2735 10.4767 11.0553 12.0646 12.2183 12.4263 13.4246 13.7461 14.2775 15.0585 15.4461 16.0460 17.8823 18.3451 18.9446 19.4526 19.4859 20.5461 20.8170 21.1868 21.8882 22.3465 22.6380 23.4438 23.7898 24.1487 24.5614 25.0431 25.3443 25.7848 26.7637 27.1368 27.6650 28.7267 29.2970 30.1337 30.2602 30.4843 31.2780 31.5858 31.9416 32.9580 33.3937 34.0872 34.3007 35.1266 36.1658 36.3007 36.4636 37.3170 37.6047 37.7120 38.7553 38.8592 39.4097 40.0421 41.0868 41.4136 41.9016 42.6973 44.0584 45.4220 46.8297 47.5847 48.2738 48.5870 49.4788 51.2025 51.6631 53.0410 53.2165 53.6756 54.2989 55.5667 57.5241 59.3714 60.1236 61.2974 62.3019 63.9266 64.0414 66.0218 66.4838 67.0281 67.8149 68.2889 68.9216 69.3098 69.8216 70.5926 70.6668 71.8627 72.7521 73.1011 74.1644 75.0616 75.7061 75.8221 76.5630 76.9109 77.0672 77.8371 78.5313 78.9747 79.9173 80.2532 80.6211 81.2001 81.8253 82.0009 83.1029 83.3774 84.0272 84.3840 84.6476 85.6605 86.4367 86.6099 87.5643 87.7970 88.3860 88.9569 89.4159 89.4464 90.7571 91.1569 91.3757 92.1010 92.4674 93.0292 94.1280 94.3502 95.3976 95.6780 95.9864 96.5591 97.2262 97.8374 97.8868 98.9424 99.6739 100.4251 101.5604 102.0055 102.5662 103.4111 103.9173 104.4758 104.9959 105.7983 105.9644 106.5674 107.4121 108.3149 108.8705 109.0635 109.4288 110.3142 110.5144 111.1597 112.3320 112.8865 113.1019 113.4375 114.9385 115.2115 116.0915 116.8006 117.6072 119.0017 119.9895 120.9807 122.4989 122.6646 123.2139 124.3869 125.7722 126.6243 128.0047 128.3428 129.9056 130.4520 132.1023 132.3352 132.6927 135.2600 136.4263 137.0770 137.9733 138.4232 138.6293 139.0732 139.5464 139.9598 141.5501 142.2713 142.8553 143.1484 143.8090 144.0045 145.1321 146.3208 147.2913 148.1834 149.1844 149.8643 149.9209 150.8690 151.9102 154.1218 156.0600 156.9816 158.4077 161.4466 161.7392 162.8846 165.9477 167.6412 170.8239 171.9309 173.3600 174.5680 175.0186 175.7502 176.3481 177.6458 180.0563 180.7454 184.5433 184.8645 187.5895 192.2198 195.8164 202.1413 203.1737 629.5931 633.9414 641.6192 893.1315 1191.5939 1193.3539 electronvolt
chargesum: 1.0000000
charge: 0.094469 -0.098538 0.157020 0.308318 -0.229127 -0.288811 0.243269 0.155480 -0.166703 0.144841 0.147825 0.151192 0.191651 0.189114
charge: 0.529806 0.036862 0.050673 -0.456199 0.195987 0.362134 -0.060758 0.051876 0.092173 0.031723 0.032306 0.031999 0.047641 0.053777
qa: 0.0945 -0.0985 0.1570 0.3083 -0.2291 -0.2888 0.2433 0.1555 -0.1667 0.1448 0.1478 0.1512 0.1917 0.1891
va: 3.6921 3.8329 0.9944 4.2624 2.2581 2.1714 1.0144 1.0038 3.8338 0.9937 0.9993 0.9920 1.0017 0.9840
dispcorr: -0.003571880 hartree
energy: -324.147806981979
dipole: -8.18831 5.55839 -2.62992 -0.34329 0.42449 0.08120 -0.01350 -0.81060 -0.82410
magnitude: 2.75721 au
magnitude: 7.00827 debye
temp: 298.15 k
press: 1.00 atm
zeropoint: 0.12429766 hartree
thermalvibcorrection: 0.00396863 hartree
thermalrotcorrection: 0.00141627 hartree
thermaltrasncorrection: 0.00141627 hartree
thermaltotal: -324.01670815 hartree
thermalcorr: 0.00680117 hartree
nonthermalcorr: 0.12429766 hartree
totalcorr: 0.13109883 hartree
thermalcorrenthalpy: 0.00094421 hartree
totalenthalpy: -324.01576394 hartree
totalentropycorr: -0.03822997 hartree
gibbsenthalpy: -324.05399391 hartree
gibbsminuselec: 0.09381307 hartree
