program: Orca
programVersion: 5.0.3
elementType: C N C O O C C C C C C C C C C H H H H H H H H H H H H H H H H H H
charge: 1
multiplicity: 1
keywords: wB97X-D3 TightOpt Freq def2-TZVPP def2/J RIJCOSX TightSCF defgrid3 CHELPG
frequency: 0.00 0.00 0.00 0.00 0.00 0.00 21.72 29.23 33.33 40.76 54.02 69.79 128.35 159.56 187.58 214.99 230.83 251.51 254.97 269.37 293.27 323.78 336.60 381.21 431.91 495.73 525.48 558.94 570.81 601.46 622.21 659.56 671.99 719.79 734.75 772.95 871.23 892.96 913.16 940.55 943.92 959.92 966.92 979.77 982.85 1021.41 1038.46 1074.28 1099.19 1131.04 1143.31 1156.84 1172.12 1187.72 1200.41 1215.95 1242.61 1284.42 1314.07 1347.86 1355.14 1378.73 1414.48 1427.89 1430.51 1435.19 1471.08 1472.98 1488.59 1492.95 1497.10 1497.94 1506.61 1511.30 1514.37 1515.51 1531.59 1603.95 1660.42 1698.82 1774.61 3053.69 3058.29 3072.47 3077.86 3097.22 3126.26 3133.97 3143.06 3145.64 3149.40 3164.75 3185.10 3196.54 3206.39 3206.86 3221.08 3646.65 3660.44
frequency: 21.72 29.23 33.33 40.76 54.02 69.79 128.35 159.56 187.58 214.99 230.83 251.51 254.97 269.37 293.27 323.78 336.60 381.21 431.91 495.73 525.48 558.94 570.81 601.46 622.21 659.56 671.99 719.79 734.75 772.95 871.23 892.96 913.16 940.55 943.92 959.92 966.92 979.77 982.85 1021.41 1038.46 1074.28 1099.19 1131.04 1143.31 1156.84 1172.12 1187.72 1200.41 1215.95 1242.61 1284.42 1314.07 1347.86 1355.14 1378.73 1414.48 1427.89 1430.51 1435.19 1471.08 1472.98 1488.59 1492.95 1497.10 1497.94 1506.61 1511.30 1514.37 1515.51 1531.59 1603.95 1660.42 1698.82 1774.61 3053.69 3058.29 3072.47 3077.86 3097.22 3126.26 3133.97 3143.06 3145.64 3149.40 3164.75 3185.10 3196.54 3206.39 3206.86 3221.08 3646.65 3660.44
formula: C12H18NO2
InChI: InChI=1S/C12H18NO2/c1-8(2)10-5-9(3)6-11(7-10)15-12(14)13-4/h5-8,13-14H,1-4H3
33 atoms
C  -4.839284 -0.799391 0.360639
N  -3.759477 -0.289665 -0.481964
C  -2.525682 -0.131034 -0.09753
O  -2.197852 -0.442111 1.114925
O  -1.675392 0.33465 -0.960268
C  -0.333077 0.561511 -0.530421
C  0.039123 1.864933 -0.273106
C  1.347836 2.103908 0.128203
C  1.831112 3.500293 0.392189
C  2.212147 1.016063 0.260751
C  1.826885 -0.290581 -0.004479
C  0.511747 -0.520175 -0.417368
C  2.801916 -1.439423 0.133453
C  2.327651 -2.453931 1.175376
C  3.065944 -2.106429 -1.217895
H  -5.545921 -1.325558 -0.274374
H  -5.343739 0.019998 0.869222
H  -4.435492 -1.490947 1.093849
H  -3.963366 0.000733 -1.425752
H  -0.671362 2.672172 -0.394513
H  1.003939 4.198249 0.506776
H  2.449847 3.847841 -0.436794
H  2.441477 3.539128 1.293648
H  3.231855 1.200813 0.579197
H  0.166814 -1.515124 -0.672286
H  3.743219 -1.012274 0.486494
H  1.401707 -2.943219 0.863825
H  2.155453 -1.982223 2.143674
H  3.075619 -3.234793 1.311129
H  2.163686 -2.578302 -1.613155
H  3.822776 -2.883705 -1.113775
H  3.419609 -1.386223 -1.955789
H  -1.242061 -0.324707 1.25662
totalener: -673.17280602 hartree
nucrepener: 1003.23728911 hartree
electener: -1676.41009512 hartree
oneelecener: -2887.21272608 hartree
twoeener: 1210.80263096 hartree
kineticenergy: 669.64019427 hartree
xcener: -65.716357508837 hartree
chargesum: 1.0000000
charge: -0.131797 -0.150360 0.546860 -0.216820 -0.231334 0.112183 -0.148722 0.018038 -0.191667 -0.121041 0.059345 -0.267579 0.044341 -0.259448 -0.247288 0.129852 0.136729 0.127572 0.195921 0.132913 0.090457 0.117974 0.105229 0.118065 0.151999 0.049031 0.070097 0.100999 0.108537 0.074511 0.104514 0.106439 0.264452
charge: 0.045882 0.376580 -0.394382 0.459895 0.383607 -0.177892 0.003001 -0.057563 0.040440 0.039011 -0.042544 -0.006218 -0.088996 0.021840 0.027031 0.028391 0.025833 0.026909 0.019297 0.033314 0.023782 0.033416 0.029181 0.037318 0.031765 0.036414 0.010536 0.015904 0.023970 0.013096 0.022628 0.019488 -0.060934
qa: -0.1318 -0.1504 0.5469 -0.2168 -0.2313 0.1122 -0.1487 0.0180 -0.1917 -0.1210 0.0593 -0.2676 0.0443 -0.2594 -0.2473 0.1299 0.1367 0.1276 0.1959 0.1329 0.0905 0.1180 0.1052 0.1181 0.1520 0.0490 0.0701 0.1010 0.1085 0.0745 0.1045 0.1064 0.2645
va: 3.8421 3.3835 4.1868 2.3239 2.2255 3.8268 4.0830 3.8364 3.9048 4.0188 3.6744 4.0688 3.8492 3.9159 3.9248 0.9936 0.9914 0.9999 1.0021 1.0122 1.0061 0.9952 1.0005 1.0147 1.0054 1.0168 1.0045 1.0046 1.0106 1.0045 1.0073 1.0058 1.0156
dispcorr: -0.012777535 hartree
energy: -673.187310614721
dipole: 7.91077 -10.70086 -2.79009 -5.25914 5.23986 -0.01928 2.59120 -2.53116 0.06004
magnitude: 2.79081 au
magnitude: 7.09367 debye
temp: 298.15 k
press: 1.00 atm
zeropoint: 0.28694164 hartree
thermalvibcorrection: 0.01376183 hartree
thermalrotcorrection: 0.00141627 hartree
thermaltrasncorrection: 0.00141627 hartree
thermaltotal: -672.88377460 hartree
thermalcorr: 0.01659437 hartree
nonthermalcorr: 0.28694164 hartree
totalcorr: 0.30353601 hartree
thermalcorrenthalpy: 0.00094421 hartree
totalenthalpy: -672.88283039 hartree
totalentropycorr: -0.06030639 hartree
gibbsenthalpy: -672.94313678 hartree
gibbsminuselec: 0.24417384 hartree
