program: Gaussian 09
title: 000044858
version: EM64L-G09RevD.01
frameworkgroup: C1[X(C9H17NO3)]
method: RPBEPBE
basis: SDD
operation: Freq
keyword: #p
keyword: freq=noraman
keyword: PBEPBE/SDD
title: #p freq=noraman PBEPBE/SDD
converged: YES YES NO NO
title: Mulliken charges:
elementType: O O O N C C C C C C C C C H H H H H H H H H H H H H H H H H
charge: -0.246771 -0.267783 -0.240497 -0.087084 -0.328351 -0.338198 -0.345105 -0.397271 -0.325782 -0.318587 -0.494137 0.239825 -0.504851 0.173794 0.203042 0.187530 0.216457 0.209136 0.189870 0.224491 0.236781 0.193180 0.214743 0.212858 0.192657 0.235402 0.247508 0.240775 0.233721 0.242646
chargesum: 0.00000
title: Mulliken charges with hydrogens summed into heavy atoms:
elementType: O O O N C C C C C C C C C
charge: -0.246771 -0.267783 -0.240497 -0.087084 0.048485 0.065788 0.053901 0.064000 0.082142 0.086928 -0.011227 0.239825 0.212292
polarizability: 1.45455622e+02 -2.76176158e-01 1.08316691e+02 8.77031221e-01 4.17307947e-01 8.62622781e+01
1716.lowfreq: -8.8904 -3.9122 -0.0005 0.0004 0.0006 14.5621 21.5009 30.8174 51.7320
frequency: 20.0956 30.7073 51.6495 64.3905 89.3435 95.9518 144.4451 178.6584 203.7005 220.9655 237.8039 281.6026 311.3167 373.7522 397.3038 426.8977 466.2636 490.1276 569.6762 601.8543 667.9655 752.5911 762.0860 807.0483 832.9237 841.7000 859.0347 900.9883 953.2352 1001.3526 1028.1215 1049.3741 1056.4483 1062.8024 1077.8132 1088.0951 1104.4921 1112.6550 1124.8546 1139.2303 1148.2077 1159.3281 1189.5228 1191.9973 1240.5402 1266.5124 1273.8822 1276.7983 1291.4308 1298.7942 1330.1401 1340.6655 1352.7462 1366.4817 1371.1013 1394.3968 1422.4930 1443.2791 1443.7678 1447.5018 1451.1341 1452.6062 1459.4474 1464.3084 1469.5603 1485.2094 1646.6535 2823.8368 2853.5537 2865.4898 2954.1389 2958.2776 2976.3212 2997.7668 3004.5686 3007.8817 3022.8037 3047.5301 3052.2320 3078.7020 3079.2510 3082.7946 3106.1762 3149.2922
redmass: 5.0171 3.3253 3.6279 2.7351 1.9391 1.2629 3.5625 3.3196 5.1285 2.8983 1.8472 3.8590 2.3281 3.5532 2.0774 4.5074 2.8619 3.6558 2.9611 2.0441 4.1779 1.1905 3.8155 4.0015 3.8541 1.6906 1.5510 2.3110 6.2171 2.7354 2.1680 3.5419 2.1346 2.3954 2.1289 3.5387 2.0765 1.2827 2.5907 2.7085 1.4411 2.7786 1.3158 1.1632 1.2618 1.3018 1.4079 1.1729 1.1566 1.3598 1.2822 1.2805 1.4968 1.4564 1.2789 1.4660 1.1892 1.0820 1.0834 1.0808 1.0966 1.0502 1.0927 1.0504 1.0866 1.0947 9.1157 1.0706 1.0708 1.0689 1.0664 1.0665 1.0654 1.0856 1.0297 1.0608 1.0892 1.0892 1.0941 1.1020 1.0963 1.0979 1.1045 1.1047
irintensity: 0.9301 0.4866 0.1298 0.8368 0.4331 0.0665 3.6275 4.0381 2.2313 9.1988 1.3823 20.4514 14.3253 7.4384 0.7286 5.2582 0.6863 0.8754 3.4855 9.7912 5.5624 11.8586 8.1259 17.5009 18.0360 2.4450 5.6164 11.4027 33.9933 21.0242 9.3351 24.4612 9.0034 1.7840 9.9462 66.7971 19.7058 2.9554 41.0067 154.7007 3.6028 102.8870 7.8245 2.8223 40.1499 10.2214 46.1373 0.9013 2.6561 27.0192 14.8931 27.8568 13.9118 1.0547 0.9111 7.1565 21.4760 1.2968 18.0371 2.3382 17.3415 14.5176 4.9223 12.3552 0.6153 15.5010 160.0132 74.1184 49.6963 157.9121 33.2179 104.0492 10.9369 18.7795 33.8007 21.8770 51.3550 35.6870 1.2378 33.2364 46.9689 36.2172 28.0861 17.0412
temp: 298.150 k
press: 1.00000 atm
elementType: 8 8 8 7 6 6 6 6 6 6 6 6 6 1 1 1 1 1 1 1 1 1 1 1 1 1 1 1 1 1
symmnumber: 1
zpe: 671215.3 jmol-1
zpe.correction: 0.255652 hartree
zpe.thermalcorrener: 0.270082 hartree
zpe.thermalcorrenthalpy: 0.271026 hartree
zpe.thermalcorrgfe: 0.211752 hartree
zpe.sumelectzpe: -632.489396 hartree
zpe.sumelectthermal: -632.474966 hartree
zpe.sumelectthermalent: -632.474022 hartree
zpe.sumelectthermalfe: -632.533296 hartree
dipole: -2.2968 -2.0475 0.1053
dipole: 3.0788
quadrupole: -80.3863 -79.3537 -78.2554
quadrupole: -0.9980 -0.3436 -0.1577
quadrupole: -1.0545 -0.0219 1.0764 -0.9980 -0.3436 -0.1577
hfenergy: -632.745048 hartree
pointgroup: C01 [X(C9H17N1O3)]
dipole: 0.9008165 -0.8097382 0.0088958 debye
polarizability: 145.4687221|0.1822109|108.1337089|0.2483123|-2.0380428|86.4321601 unknown
InChI: InChI=1S/C9H17NO3/c1-12-9(11)3-2-4-10-5-7-13-8-6-10/h2-8H2,1H3
charge 0 multiplicity 1
30 atoms
O  -4.546351 0.544876 -0.026462
O  4.412258 -0.636768 0.118541
O  3.3148 1.385612 -0.239722
N  -1.766635 -0.312687 0.126091
C  -0.48566 -0.871928 -0.366959
C  -2.147253 0.963853 -0.534798
C  -2.878757 -1.29302 0.011723
C  0.738605 -0.020374 0.024418
C  -3.442447 1.513339 0.085022
C  -4.159646 -0.713864 0.632458
C  2.05445 -0.748587 -0.322901
C  3.276591 0.137487 -0.14767
C  5.683492 0.116071 0.257738
H  -0.497296 -1.013352 -1.481272
H  -0.377077 -1.880272 0.080568
H  -2.297976 0.820261 -1.635882
H  -1.341372 1.70642 -0.395283
H  -2.59677 -2.218798 0.549118
H  -3.082707 -1.562208 -1.056352
H  0.692991 0.187975 1.109419
H  0.732119 0.95623 -0.491837
H  -3.265525 1.756326 1.155032
H  -3.786137 2.414498 -0.449207
H  -5.014787 -1.395778 0.492161
H  -3.997574 -0.534056 1.717321
H  2.035871 -1.072545 -1.384938
H  2.189162 -1.664738 0.278734
H  5.906316 0.66637 -0.67194
H  6.443811 -0.651977 0.456718
H  5.612904 0.833034 1.092859
