program: Gaussian 09
title: 000005196
version: EM64L-G09RevD.01
frameworkgroup: C1[X(CH5N3O)]
method: RPBEPBE
basis: SDD
operation: Freq
keyword: #pfreq=noraman
keyword: PBEPBE/SDD
title: #p freq=noraman PBEPBE/SDD
converged: NO NO NO NO
title: Mulliken charges:
elementType: O N N N C H H H H H
charge: -0.300073 -0.382881 -0.504681 -0.635765 0.265729 0.308300 0.302706 0.302814 0.302819 0.341033
chargesum: 0.00000
title: Mulliken charges with hydrogens summed into heavy atoms:
elementType: O N N N C
charge: -0.300073 -0.074581 0.100839 0.008086 0.265729
polarizability: 4.52664192e+01 -3.31738941e+00 3.94913908e+01 -7.91044092e-03 -3.54959252e-03 2.13863242e+01
1716.lowfreq: -11.4894 -7.3066 0.0005 0.0006 0.0009 8.7202 83.7925 149.4375 263.0172
frequency: 83.2797 149.2875 263.0164 345.6150 447.9308 470.4993 521.5294 646.0771 728.2418 776.7049 921.9429 1035.9879 1231.4818 1291.0137 1323.9491 1457.5310 1598.3379 1655.1152 1693.7710 3395.7612 3504.9674 3543.8667 3559.4191 3701.6900
redmass: 1.0782 3.8557 3.7948 1.1430 3.1315 1.0924 1.1982 5.2102 6.0845 1.6198 2.6323 2.3247 4.0996 1.1541 1.7993 2.1087 1.2922 4.0905 1.0662 1.0429 1.0991 1.0486 1.0756 1.1039
irintensity: 9.7966 9.6340 26.9084 15.4464 7.1798 249.0384 321.5114 2.2254 2.4836 144.6700 4.8026 6.5260 4.0217 0.0040 114.2616 257.7442 92.4510 315.6025 16.6775 0.8162 0.7652 38.0250 10.1309 35.9905
temp: 298.150 k
press: 1.00000 atm
elementType: 8 7 7 7 6 1 1 1 1 1
symmnumber: 1
zpe: 205440.8 jmol-1
zpe.correction: 0.078248 hartree
zpe.thermalcorrener: 0.084504 hartree
zpe.thermalcorrenthalpy: 0.085448 hartree
zpe.thermalcorrgfe: 0.048889 hartree
zpe.sumelectzpe: -280.161125 hartree
zpe.sumelectthermal: -280.154870 hartree
zpe.sumelectthermalent: -280.153925 hartree
zpe.sumelectthermalfe: -280.190485 hartree
dipole: 1.1623 -3.2399 0.0006
dipole: 3.4421
quadrupole: -24.9159 -30.5001 -30.0497
quadrupole: -6.3137 -0.0206 0.0009
quadrupole: 3.5727 -2.0115 -1.5611 -6.3137 -0.0206 0.0009
hfenergy: -280.2393734 hartree
pointgroup: C01 [X(C1H5N3O1)]
dipole: -0.4810378 -1.2659006 -0.0007442 debye
dipolederiv: -0.6275861 -0.0405547 0.0000842 0.0278735 -1.1304567 0.000914 -0.0000361 -0.0016437 -0.4089906 -0.6176687 0.2486635 0.0005629 0.597835 -0.2897951 -0.0006143 -0.0004293 -0.0001578 -0.5419679 -0.2519429 0.1949438 -0.000649 0.3118695 -0.3156571 0.0008216 -0.0008654 0.0005837 -0.0154487 -1.1390038 -0.3525264 -0.000986 -0.3420881 -0.4343397 -0.0000882 0.0000361 0.0002955 -0.8017831 1.7927361 0.0592076 0.0001788 -0.151517 1.5434791 -0.0008144 -0.0002668 0.0003231 0.3557706 0.0634453 -0.0545828 -0.0002758 -0.0699713 0.0726794 0.0001227 -0.0007818 0.0003678 0.378385 0.1985764 -0.0315435 -0.067755 -0.1781487 0.1515471 0.1381136 -0.0355478 0.0791365 0.1057399 0.1984152 -0.0308993 0.068184 -0.1772359 0.1507912 -0.1385365 0.036601 -0.0792147 0.1070721 0.1840443 0.0041177 0.0003713 -0.0055651 0.0874628 0.0000625 0.0006088 0.0002852 0.4129556 0.1989841 0.0031741 0.0002846 -0.0130518 0.164289 0.000019 0.0006814 0.0000245 0.4082672 unknown
polarizability: 45.3884741|3.2070731|39.3693332|-0.0017454|0.0103929|21.386327 unknown
InChI: InChI=1S/CH5N3O/c2-1(5)4-3/h4H,2-3H2
charge 0 multiplicity 1
10 atoms
O  -0.277839 1.195169 0.000633
N  0.745752 -0.908624 -0.000229
N  2.059102 -0.395074 0.000817
N  -1.60651 -0.732654 -0.000412
C  -0.379707 -0.067965 -0.001942
H  0.670002 -1.925165 0.000654
H  2.241134 0.165899 -0.843317
H  2.23917 0.169118 0.843166
H  -1.704005 -1.745482 0.000121
H  -2.441999 -0.154121 0.001008
