program: Orca
programVersion: 5.0.3
elementType: Cl C C C C C N C C C C C C O N C C C C C C C C H H H H H H H H H H H H H H H H H H H H H H
charge: 1
multiplicity: 1
keywords: wB97X-D3 TightOpt Freq def2-TZVPP def2/J RIJCOSX TightSCF defgrid3 CHELPG
frequency: 0.00 0.00 0.00 0.00 0.00 0.00 2.13 18.58 23.50 34.86 38.37 49.31 65.11 82.95 99.07 115.19 140.95 169.08 206.97 238.47 277.89 288.65 330.51 348.17 382.56 399.96 413.35 422.08 422.67 436.23 458.86 493.01 510.10 512.66 528.80 560.37 614.30 634.29 647.45 665.23 684.47 701.60 726.48 743.81 762.70 786.17 792.73 824.10 841.85 855.07 866.63 877.10 880.73 891.21 917.46 933.61 975.99 982.08 987.48 990.44 1003.44 1013.77 1016.02 1030.67 1032.61 1045.30 1059.17 1061.16 1073.98 1102.80 1116.06 1142.18 1144.27 1149.12 1180.69 1193.46 1204.71 1216.99 1220.20 1226.81 1237.01 1243.96 1262.80 1270.08 1300.52 1305.84 1308.62 1327.27 1333.57 1341.80 1348.45 1353.64 1360.40 1365.49 1370.46 1399.17 1441.71 1464.14 1465.15 1494.77 1499.21 1505.53 1507.48 1509.74 1531.74 1551.04 1555.63 1575.40 1658.25 1671.10 1679.37 1689.16 1739.13 3064.87 3071.65 3079.33 3091.31 3104.57 3110.92 3112.61 3144.11 3151.54 3158.16 3161.86 3193.44 3199.65 3209.34 3211.20 3220.02 3230.17 3232.36 3234.12 3237.67 3674.06 3756.92
frequency: 2.13 18.58 23.50 34.86 38.37 49.31 65.11 82.95 99.07 115.19 140.95 169.08 206.97 238.47 277.89 288.65 330.51 348.17 382.56 399.96 413.35 422.08 422.67 436.23 458.86 493.01 510.10 512.66 528.80 560.37 614.30 634.29 647.45 665.23 684.47 701.60 726.48 743.81 762.70 786.17 792.73 824.10 841.85 855.07 866.63 877.10 880.73 891.21 917.46 933.61 975.99 982.08 987.48 990.44 1003.44 1013.77 1016.02 1030.67 1032.61 1045.30 1059.17 1061.16 1073.98 1102.80 1116.06 1142.18 1144.27 1149.12 1180.69 1193.46 1204.71 1216.99 1220.20 1226.81 1237.01 1243.96 1262.80 1270.08 1300.52 1305.84 1308.62 1327.27 1333.57 1341.80 1348.45 1353.64 1360.40 1365.49 1370.46 1399.17 1441.71 1464.14 1465.15 1494.77 1499.21 1505.53 1507.48 1509.74 1531.74 1551.04 1555.63 1575.40 1658.25 1671.10 1679.37 1689.16 1739.13 3064.87 3071.65 3079.33 3091.31 3104.57 3110.92 3112.61 3144.11 3151.54 3158.16 3161.86 3193.44 3199.65 3209.34 3211.20 3220.02 3230.17 3232.36 3234.12 3237.67 3674.06 3756.92
formula: C19H22ClN2O
InChI: InChI=1S/C19H22ClN2O/c20-16-12-10-15(11-13-16)14-22(18-8-4-5-9-18)19(23)21-17-6-2-1-3-7-17/h1-3,6-7,10-13,18,21,23H,4-5,8-9,14H2
45 atoms
Cl -5.602112 -2.326512 -0.684119
C  -4.22412 -1.49571 -0.065566
C  -2.957992 -1.838217 -0.514501
C  -1.854527 -1.167449 -0.015811
C  -2.001307 -0.152654 0.920503
C  -0.810844 0.570782 1.503494
N  0.265279 0.828341 0.535166
C  0.172199 1.992147 -0.367478
C  -1.240095 2.410852 -0.771899
C  -0.974188 3.762849 -1.430443
C  0.099408 4.427368 -0.546043
C  0.791882 3.274172 0.212329
C  1.342416 0.076487 0.534554
O  1.340097 -0.988086 1.301361
N  2.421497 0.333518 -0.2057
C  3.564061 -0.539518 -0.233864
C  3.54696 -1.660028 -1.054276
C  4.648972 -2.50057 -1.073253
C  5.755395 -2.212681 -0.287238
C  5.766004 -1.087591 0.524908
C  4.665793 -0.245669 0.558803
C  -3.277589 0.177045 1.357596
C  -4.390044 -0.490079 0.873571
H  -2.841784 -2.626199 -1.245707
H  -0.871409 -1.450583 -0.371872
H  -0.387848 0.00446 2.329777
H  -1.116036 1.535388 1.907466
H  0.677847 1.707685 -1.294197
H  -1.871013 2.546612 0.107863
H  -1.729398 1.688908 -1.423244
H  -1.877613 4.362605 -1.516617
H  -0.594598 3.611934 -2.443005
H  -0.355122 5.11923 0.161254
H  0.805276 5.00529 -1.13928
H  0.572916 3.32092 1.280879
H  1.878711 3.300787 0.116644
H  2.469962 1.209452 -0.696039
H  2.683253 -1.862294 -1.675386
H  4.645535 -3.375431 -1.70927
H  6.615712 -2.868339 -0.308983
H  6.630817 -0.864859 1.135152
H  4.659546 0.633936 1.190281
H  -3.414381 0.968552 2.085614
H  -5.381937 -0.229132 1.215639
H  2.188912 -1.449664 1.254793
totalener: -1382.08336628 hartree
nucrepener: 1986.38622280 hartree
electener: -3368.46958908 hartree
oneelecener: -5810.36704476 hartree
twoeener: 2441.89745568 hartree
kineticenergy: 1376.45478532 hartree
xcener: -112.675189886514 hartree
chargesum: 1.0000000
charge: -0.034326 0.077725 -0.114389 -0.174675 0.018696 -0.021588 -0.043306 -0.092440 -0.131184 -0.152622 -0.116036 -0.151484 0.458053 -0.229406 -0.175690 0.019837 -0.189042 -0.072304 -0.094687 -0.077342 -0.176390 -0.183023 -0.118393 0.129138 0.110844 0.128794 0.120328 0.085795 0.092836 0.109268 0.099673 0.093092 0.094317 0.090211 0.091012 0.077840 0.194353 0.151101 0.154918 0.156081 0.154818 0.146020 0.125088 0.136627 0.231861
charge: 0.436628 -0.390309 -0.021565 -0.007959 -0.093606 -0.004524 0.316992 -0.094425 0.000191 -0.001359 0.004898 -0.004935 -0.316656 0.443608 0.367951 -0.157883 -0.001195 0.015467 0.025198 0.016792 0.001092 0.002466 -0.015865 0.028731 0.019385 0.035782 0.035479 0.030930 0.029231 0.027466 0.023991 0.022941 0.023265 0.019961 0.024908 0.010389 -0.006404 0.031736 0.034349 0.035463 0.034458 0.031787 0.029322 0.031326 -0.075499
qa: -0.0343 0.0777 -0.1144 -0.1747 0.0187 -0.0216 -0.0433 -0.0924 -0.1312 -0.1526 -0.1160 -0.1515 0.4581 -0.2294 -0.1757 0.0198 -0.1890 -0.0723 -0.0947 -0.0773 -0.1764 -0.1830 -0.1184 0.1291 0.1108 0.1288 0.1203 0.0858 0.0928 0.1093 0.0997 0.0931 0.0943 0.0902 0.0910 0.0778 0.1944 0.1511 0.1549 0.1561 0.1548 0.1460 0.1251 0.1366 0.2319
va: 1.2707 4.0050 4.0497 3.9648 3.6004 3.8015 3.2498 3.8507 3.9059 3.9362 3.8693 3.8873 4.1124 2.2731 3.2733 3.6686 4.0742 3.9521 3.9621 3.9476 4.0849 4.0300 4.0260 1.0137 1.0135 1.0036 0.9884 1.0085 1.0161 1.0126 1.0167 1.0125 1.0129 1.0165 1.0132 1.0214 1.0045 1.0058 0.9962 0.9947 0.9963 1.0085 1.0070 1.0093 1.0361
dispcorr: -0.022836324 hartree
energy: -1382.109217281389
dipole: 21.43043 -17.98791 3.44252 23.43288 -22.41101 1.02187 -0.13088 0.42187 0.29100
magnitude: 3.60276 au
magnitude: 9.15748 debye
temp: 298.15 k
press: 1.00 atm
zeropoint: 0.38319766 hartree
thermalvibcorrection: 0.01801715 hartree
thermalrotcorrection: 0.00141627 hartree
thermaltrasncorrection: 0.00141627 hartree
thermaltotal: -1381.70516994 hartree
thermalcorr: 0.02084969 hartree
nonthermalcorr: 0.38319766 hartree
totalcorr: 0.40404734 hartree
thermalcorrenthalpy: 0.00094421 hartree
totalenthalpy: -1381.70422573 hartree
totalentropycorr: -0.07109374 hartree
gibbsenthalpy: -1381.77531947 hartree
gibbsminuselec: 0.33389782 hartree
