program: Orca
programVersion: 5.0.3
elementType: N C C C C C C C C C C C C C C C C C C C H H H H H H H H H H H H H H H H H H H H H H
charge: 1
multiplicity: 1
keywords: wB97X-D3 TightOpt Freq def2-TZVPP def2/J RIJCOSX TightSCF defgrid3 CHELPG
frequency: 0.00 0.00 0.00 0.00 0.00 0.00 29.61 50.40 73.44 76.71 93.56 122.25 134.80 166.65 188.98 225.54 237.41 253.14 275.15 290.71 307.01 327.49 353.32 396.22 429.78 453.31 470.13 492.75 534.11 540.36 582.19 604.35 613.32 680.62 695.77 709.03 754.56 772.43 778.78 790.50 807.65 808.37 819.42 831.51 888.65 901.80 913.47 927.88 932.94 954.88 988.21 995.22 1003.37 1015.33 1026.24 1043.32 1047.29 1054.41 1057.70 1081.49 1086.21 1096.32 1133.46 1144.02 1157.31 1171.53 1189.79 1190.81 1197.98 1204.38 1211.78 1240.14 1264.99 1279.92 1289.16 1314.38 1318.37 1325.20 1330.84 1341.01 1386.31 1388.64 1401.42 1408.36 1411.10 1415.07 1449.22 1473.39 1481.66 1489.67 1491.91 1497.25 1504.29 1509.12 1509.77 1513.98 1541.99 1546.56 1640.54 1649.28 1662.99 1683.10 1689.36 1727.59 3010.34 3051.46 3071.28 3090.31 3094.05 3105.58 3117.29 3118.93 3183.04 3184.53 3189.55 3194.87 3195.91 3198.14 3199.94 3202.08 3216.19 3216.53 3229.88 3230.08 3389.82 3518.84
frequency: 29.61 50.40 73.44 76.71 93.56 122.25 134.80 166.65 188.98 225.54 237.41 253.14 275.15 290.71 307.01 327.49 353.32 396.22 429.78 453.31 470.13 492.75 534.11 540.36 582.19 604.35 613.32 680.62 695.77 709.03 754.56 772.43 778.78 790.50 807.65 808.37 819.42 831.51 888.65 901.80 913.47 927.88 932.94 954.88 988.21 995.22 1003.37 1015.33 1026.24 1043.32 1047.29 1054.41 1057.70 1081.49 1086.21 1096.32 1133.46 1144.02 1157.31 1171.53 1189.79 1190.81 1197.98 1204.38 1211.78 1240.14 1264.99 1279.92 1289.16 1314.38 1318.37 1325.20 1330.84 1341.01 1386.31 1388.64 1401.42 1408.36 1411.10 1415.07 1449.22 1473.39 1481.66 1489.67 1491.91 1497.25 1504.29 1509.12 1509.77 1513.98 1541.99 1546.56 1640.54 1649.28 1662.99 1683.10 1689.36 1727.59 3010.34 3051.46 3071.28 3090.31 3094.05 3105.58 3117.29 3118.93 3183.04 3184.53 3189.55 3194.87 3195.91 3198.14 3199.94 3202.08 3216.19 3216.53 3229.88 3230.08 3389.82 3518.84
formula: C19H22N
InChI: InChI=1S/C19H22N/c1-20-14-6-11-19-17-9-4-2-7-15(17)12-13-16-8-3-5-10-18(16)19/h2-5,7-11H,6,12-14,20H2,1H3
42 atoms
N  2.148051 -1.339028 1.478798
C  -0.192445 1.761904 1.338365
C  -1.154933 0.685702 1.838125
C  0.67116 1.478075 0.121416
C  -2.18671 0.284508 0.819431
C  -0.350616 -0.787771 -0.461659
C  0.582551 0.352241 -0.709524
C  -1.790447 -0.442338 -0.304544
C  0.026902 -2.070711 -0.410342
C  1.607116 2.463703 -0.20712
C  -3.526622 0.610281 0.972347
C  1.367868 0.294554 -1.86767
C  -2.728087 -0.830893 -1.251596
C  1.406587 -2.689076 -0.476901
C  2.402771 2.378601 -1.332793
C  -4.462476 0.227479 0.022275
C  2.554034 -1.9080 0.155045
C  2.26945 1.290047 -2.184958
C  -4.06392 -0.495124 -1.08976
C  3.118474 -0.371595 2.051043
H  0.463986 2.060756 2.160822
H  -0.783176 2.651622 1.103648
H  -1.651493 1.069184 2.729586
H  -0.608272 -0.206133 2.171402
H  -0.768228 -2.796949 -0.280317
H  1.688916 3.33369 0.434921
H  -3.844792 1.164141 1.847737
H  1.242381 -0.548736 -2.536264
H  -2.408273 -1.388178 -2.123578
H  1.69293 -2.889709 -1.512483
H  1.348753 -3.67175 -0.003876
H  3.417803 -2.547789 0.328725
H  2.862639 -1.060083 -0.450014
H  3.105385 3.169648 -1.559907
H  -5.503412 0.491712 0.154367
H  2.855001 1.225617 -3.092478
H  -4.789922 -0.796561 -1.833182
H  1.973491 -2.096934 2.135987
H  4.081448 -0.861241 2.169284
H  2.751996 -0.02719 3.014508
H  3.200229 0.466563 1.362693
H  1.243509 -0.877269 1.331252
totalener: -791.84156733 hartree
nucrepener: 1557.33924139 hartree
electener: -2349.18080872 hartree
oneelecener: -4144.45043807 hartree
twoeener: 1795.26962936 hartree
kineticenergy: 787.44064258 hartree
xcener: -80.683040908810 hartree
chargesum: 1.0000000
charge: 0.114670 -0.090703 -0.220199 -0.275675 -0.065254 0.021384 0.224080 0.066897 -0.180378 -0.093062 -0.060906 -0.258886 -0.191376 -0.136047 -0.121824 -0.124998 -0.170456 -0.122944 -0.110204 -0.165612 0.097811 0.127889 0.107624 0.093632 0.126971 0.134312 0.119992 0.146870 0.133353 0.116597 0.124219 0.153534 0.164100 0.151893 0.141608 0.151309 0.140821 0.171330 0.141552 0.140863 0.143123 0.132089
charge: 0.530891 -0.007845 -0.010285 -0.062784 -0.059925 -0.061090 -0.071872 -0.055442 -0.005066 0.000417 0.007351 0.004844 0.011012 -0.023174 0.000764 0.004299 0.020386 -0.008186 0.001367 0.076920 0.029815 0.046398 0.038310 0.014585 0.033009 0.033058 0.026749 0.032363 0.028304 0.045765 0.036325 0.032477 0.030527 0.030837 0.027858 0.029312 0.027391 0.047408 0.028366 0.026118 0.030869 0.031573
qa: 0.1147 -0.0907 -0.2202 -0.2757 -0.0653 0.0214 0.2241 0.0669 -0.1804 -0.0931 -0.0609 -0.2589 -0.1914 -0.1360 -0.1218 -0.1250 -0.1705 -0.1229 -0.1102 -0.1656 0.0978 0.1279 0.1076 0.0936 0.1270 0.1343 0.1200 0.1469 0.1334 0.1166 0.1242 0.1535 0.1641 0.1519 0.1416 0.1513 0.1408 0.1713 0.1416 0.1409 0.1431 0.1321
va: 3.6506 3.8364 3.8882 3.7414 3.7469 3.4321 2.9388 3.4950 3.7988 3.8870 3.9292 3.9873 4.0034 3.8782 3.9741 3.9983 3.8596 3.9742 3.9717 3.8305 1.0074 1.0044 1.0180 1.0004 1.0131 1.0014 1.0092 1.0049 1.0078 1.0073 1.0042 1.0036 0.9902 0.9957 0.9985 0.9979 0.9993 0.9935 0.9987 0.9937 1.0012 1.1099
dispcorr: -0.023714582 hartree
energy: -791.867574377203
dipole: 11.78019 -8.58917 3.19102 -4.19019 2.60449 -1.58570 7.67592 -5.83067 1.84524
magnitude: 4.01273 au
magnitude: 10.19954 debye
temp: 298.15 k
press: 1.00 atm
zeropoint: 0.37264519 hartree
thermalvibcorrection: 0.01439058 hartree
thermalrotcorrection: 0.00141627 hartree
thermaltrasncorrection: 0.00141627 hartree
thermaltotal: -791.47770607 hartree
thermalcorr: 0.01722312 hartree
nonthermalcorr: 0.37264519 hartree
totalcorr: 0.38986831 hartree
thermalcorrenthalpy: 0.00094421 hartree
totalenthalpy: -791.47676186 hartree
totalentropycorr: -0.06093691 hartree
gibbsenthalpy: -791.53769877 hartree
gibbsminuselec: 0.32987561 hartree
