program: Orca
programVersion: 5.0.3
elementType: O O O O N C C C C C C C C C C C C C C C C C C C H H H H H H H H H H H H H H H H H H H H H H
charge: 1
multiplicity: 1
keywords: wB97X-D3 TightOpt Freq def2-TZVPP def2/J RIJCOSX TightSCF defgrid3 CHELPG
frequency: 0.00 0.00 0.00 0.00 0.00 0.00 39.25 52.81 58.56 68.20 106.68 126.07 165.19 186.45 208.08 232.12 251.14 264.52 281.92 294.09 326.31 330.68 347.25 357.64 360.22 375.29 401.56 407.45 419.18 422.93 435.32 468.87 482.73 506.07 527.87 544.41 571.25 589.12 601.76 611.90 623.36 646.72 653.29 698.75 709.26 725.06 772.87 789.30 799.02 830.73 850.38 853.58 880.09 924.76 934.84 954.73 966.35 969.35 981.82 988.65 994.23 1019.23 1024.14 1033.31 1047.51 1052.06 1053.15 1067.48 1081.50 1087.47 1105.47 1122.10 1147.65 1155.34 1169.82 1182.33 1192.30 1200.26 1219.96 1231.83 1237.53 1256.32 1264.79 1266.92 1272.18 1280.92 1305.03 1325.78 1337.02 1339.21 1357.42 1366.74 1370.81 1378.38 1383.38 1390.38 1391.48 1401.12 1406.51 1421.50 1431.46 1442.82 1470.27 1477.56 1479.22 1488.49 1500.03 1501.23 1504.46 1518.26 1520.78 1582.36 1703.36 1722.85 1740.44 1868.71 3060.92 3070.58 3075.37 3094.10 3099.52 3105.39 3110.19 3115.36 3115.67 3122.89 3144.86 3158.83 3161.63 3164.66 3166.78 3189.28 3204.26 3227.43 3262.05 3412.87 3874.81 3890.84
frequency: 39.25 52.81 58.56 68.20 106.68 126.07 165.19 186.45 208.08 232.12 251.14 264.52 281.92 294.09 326.31 330.68 347.25 357.64 360.22 375.29 401.56 407.45 419.18 422.93 435.32 468.87 482.73 506.07 527.87 544.41 571.25 589.12 601.76 611.90 623.36 646.72 653.29 698.75 709.26 725.06 772.87 789.30 799.02 830.73 850.38 853.58 880.09 924.76 934.84 954.73 966.35 969.35 981.82 988.65 994.23 1019.23 1024.14 1033.31 1047.51 1052.06 1053.15 1067.48 1081.50 1087.47 1105.47 1122.10 1147.65 1155.34 1169.82 1182.33 1192.30 1200.26 1219.96 1231.83 1237.53 1256.32 1264.79 1266.92 1272.18 1280.92 1305.03 1325.78 1337.02 1339.21 1357.42 1366.74 1370.81 1378.38 1383.38 1390.38 1391.48 1401.12 1406.51 1421.50 1431.46 1442.82 1470.27 1477.56 1479.22 1488.49 1500.03 1501.23 1504.46 1518.26 1520.78 1582.36 1703.36 1722.85 1740.44 1868.71 3060.92 3070.58 3075.37 3094.10 3099.52 3105.39 3110.19 3115.36 3115.67 3122.89 3144.86 3158.83 3161.63 3164.66 3166.78 3189.28 3204.26 3227.43 3262.05 3412.87 3874.81 3890.84
formula: C19H22NO4
InChI: InChI=1S/C19H22NO4/c1-2-8-20-9-7-18-15-11-3-4-12(21)16(15)24-17(18)13(22)5-6-19(18,23)14(20)10-11/h2-4,14,17,20-21,23H,1,5-10H2
46 atoms
O  2.603202 0.367531 1.235817
O  -1.485163 2.161606 0.45539
O  3.23287 2.233241 -0.588933
O  4.337589 -1.87494 0.386327
N  -2.41363 -0.293145 0.653168
C  0.319859 0.595432 0.69739
C  -0.714005 1.194871 -0.261486
C  -1.682947 0.03758 -0.635124
C  1.628068 1.379486 0.959362
C  -0.380435 0.18999 2.004519
C  0.928779 -0.616092 0.051483
C  -0.065559 1.834857 -1.4806
C  -1.048821 -1.185384 -1.31138
C  -1.502086 -0.796973 1.733716
C  0.339172 -1.506369 -0.810866
C  0.979681 2.870572 -1.052488
C  2.080309 2.189664 -0.271645
C  2.23926 -0.698161 0.455302
C  -3.616555 -1.18013 0.496822
C  1.133486 -2.57296 -1.23156
C  3.045184 -1.743996 0.04146
C  2.448059 -2.688818 -0.798647
C  -4.589193 -0.669061 -0.519465
C  -5.703629 -0.038401 -0.183708
H  -2.456338 0.448794 -1.284345
H  1.573462 2.043702 1.823383
H  -0.763321 1.075068 2.513574
H  0.337607 -0.289203 2.670119
H  -0.835884 2.29966 -2.103248
H  0.411571 1.069425 -2.094477
H  -1.004665 -0.961374 -2.380036
H  -1.71664 -2.046558 -1.235798
H  -1.117578 -1.760123 1.401005
H  -2.116673 -0.957197 2.617962
H  0.521128 3.638588 -0.423576
H  1.427187 3.361594 -1.913452
H  -1.795862 2.842126 -0.144116
H  -4.080011 -1.227692 1.481521
H  -3.251456 -2.176323 0.250974
H  0.742873 -3.312103 -1.920182
H  3.062264 -3.510414 -1.143181
H  -4.371611 -0.864902 -1.563804
H  4.636945 -1.092193 0.85508
H  -6.404011 0.304656 -0.933368
H  -5.968864 0.143498 0.852042
H  -2.747203 0.626737 0.957309
totalener: -1092.77375361 hartree
nucrepener: 2283.00264874 hartree
electener: -3375.77640234 hartree
oneelecener: -6002.88781356 hartree
twoeener: 2627.11141122 hartree
kineticenergy: 1087.19103105 hartree
xcener: -105.136578086236 hartree
chargesum: 1.0000000
charge: -0.319998 -0.355930 -0.246394 -0.266304 0.229266 0.549626 0.192923 -0.079140 0.182884 -0.267387 -0.208357 -0.233454 -0.287808 -0.222991 -0.180995 -0.132980 0.118207 0.048984 -0.108404 -0.094878 0.159192 -0.165748 -0.204700 -0.147942 0.166845 0.117631 0.132198 0.131886 0.101254 0.123931 0.128284 0.124314 0.169758 0.144983 0.100782 0.114467 0.194010 0.132763 0.148033 0.126551 0.136375 0.142491 0.205493 0.135890 0.107790 0.156597
charge: 0.296163 0.324248 0.195045 0.380001 0.461837 -0.110347 -0.215419 -0.023731 -0.092551 0.017018 -0.071688 0.005839 0.012187 0.026127 -0.094269 0.003445 -0.249264 -0.186331 -0.004408 -0.001728 -0.192315 0.021407 -0.054771 0.078243 0.039202 0.042726 0.033136 0.050198 0.030985 0.045300 0.046446 0.033111 0.040150 0.033955 0.033144 0.041376 -0.122438 0.040736 0.034775 0.027294 0.035049 0.021493 -0.094875 0.021612 0.015564 0.026323
qa: -0.3200 -0.3559 -0.2464 -0.2663 0.2293 0.5496 0.1929 -0.0791 0.1829 -0.2674 -0.2084 -0.2335 -0.2878 -0.2230 -0.1810 -0.1330 0.1182 0.0490 -0.1084 -0.0949 0.1592 -0.1657 -0.2047 -0.1479 0.1668 0.1176 0.1322 0.1319 0.1013 0.1239 0.1283 0.1243 0.1698 0.1450 0.1008 0.1145 0.1940 0.1328 0.1480 0.1266 0.1364 0.1425 0.2055 0.1359 0.1078 0.1566
va: 2.1203 2.1071 2.2136 2.2253 3.5816 3.2256 4.1174 3.9267 3.8205 3.8743 3.4641 3.8870 4.0161 3.8648 3.7451 3.8250 4.0965 3.8937 3.8636 4.0035 4.1942 4.0078 3.7880 3.9559 0.9918 0.9876 1.0139 1.0175 1.0120 1.0023 0.9922 0.9979 0.9852 1.0071 1.0235 1.0321 1.0448 1.0067 0.9958 1.0021 1.0088 1.0040 1.0369 1.0078 1.0155 1.0483
dispcorr: -0.029155764 hartree
energy: -1092.807268336717
dipole: -26.03387 21.15711 -4.87676 -0.33602 0.54477 0.20875 -1.95109 2.22014 0.26905
magnitude: 4.88863 au
magnitude: 12.42591 debye
temp: 298.15 k
press: 1.00 atm
zeropoint: 0.39343251 hartree
thermalvibcorrection: 0.01649970 hartree
thermalrotcorrection: 0.00141627 hartree
thermaltrasncorrection: 0.00141627 hartree
thermaltotal: -1092.39450358 hartree
thermalcorr: 0.01933224 hartree
nonthermalcorr: 0.39343251 hartree
totalcorr: 0.41276475 hartree
thermalcorrenthalpy: 0.00094421 hartree
totalenthalpy: -1092.39355937 hartree
totalentropycorr: -0.06440124 hartree
gibbsenthalpy: -1092.45796062 hartree
gibbsminuselec: 0.34930772 hartree
