program: Orca
programVersion: 5.0.3
elementType: O O O O N C C C C C C C C C C C C C C C C C C C H H H H H H H H H H H H H H H H H H H H H H
charge: 1
multiplicity: 1
keywords: wB97X-D3 TightOpt Freq def2-TZVPP def2/J RIJCOSX TightSCF defgrid3 CHELPG
frequency: 0.00 0.00 0.00 0.00 0.00 0.00 39.84 58.94 67.29 76.82 99.74 111.77 124.34 159.23 170.20 226.63 237.95 250.56 258.45 284.90 291.76 301.05 331.54 352.42 364.09 374.51 387.41 398.79 416.22 427.58 438.39 471.16 482.64 514.52 538.54 545.52 572.37 593.54 602.09 611.00 623.16 648.00 655.06 681.42 711.22 722.88 780.88 791.65 820.59 827.96 848.89 853.24 872.24 905.59 939.30 948.89 963.57 977.35 980.66 988.51 1001.05 1015.72 1026.21 1028.08 1044.29 1049.92 1056.05 1059.55 1080.02 1082.56 1100.31 1127.99 1141.81 1146.79 1155.06 1183.39 1194.16 1214.13 1225.58 1232.31 1238.60 1257.55 1264.54 1275.20 1279.22 1287.49 1296.80 1316.96 1332.04 1337.49 1344.72 1367.37 1371.96 1379.99 1383.01 1387.38 1388.75 1403.04 1410.70 1412.65 1421.84 1452.30 1468.90 1477.99 1486.14 1490.56 1495.55 1496.52 1505.79 1513.69 1518.83 1582.09 1703.48 1723.53 1745.92 1869.89 3044.58 3074.12 3083.97 3092.82 3093.98 3106.43 3107.15 3111.12 3112.66 3134.35 3144.08 3157.12 3157.34 3166.45 3173.00 3174.36 3204.47 3227.30 3264.19 3424.20 3876.26 3913.25
frequency: 39.84 58.94 67.29 76.82 99.74 111.77 124.34 159.23 170.20 226.63 237.95 250.56 258.45 284.90 291.76 301.05 331.54 352.42 364.09 374.51 387.41 398.79 416.22 427.58 438.39 471.16 482.64 514.52 538.54 545.52 572.37 593.54 602.09 611.00 623.16 648.00 655.06 681.42 711.22 722.88 780.88 791.65 820.59 827.96 848.89 853.24 872.24 905.59 939.30 948.89 963.57 977.35 980.66 988.51 1001.05 1015.72 1026.21 1028.08 1044.29 1049.92 1056.05 1059.55 1080.02 1082.56 1100.31 1127.99 1141.81 1146.79 1155.06 1183.39 1194.16 1214.13 1225.58 1232.31 1238.60 1257.55 1264.54 1275.20 1279.22 1287.49 1296.80 1316.96 1332.04 1337.49 1344.72 1367.37 1371.96 1379.99 1383.01 1387.38 1388.75 1403.04 1410.70 1412.65 1421.84 1452.30 1468.90 1477.99 1486.14 1490.56 1495.55 1496.52 1505.79 1513.69 1518.83 1582.09 1703.48 1723.53 1745.92 1869.89 3044.58 3074.12 3083.97 3092.82 3093.98 3106.43 3107.15 3111.12 3112.66 3134.35 3144.08 3157.12 3157.34 3166.45 3173.00 3174.36 3204.47 3227.30 3264.19 3424.20 3876.26 3913.25
formula: C19H22NO4
InChI: InChI=1S/C19H22NO4/c1-2-8-20-9-7-18-15-11-3-4-12(21)16(15)24-17(18)13(22)5-6-19(18,23)14(20)10-11/h2-4,14,17,20-21,23H,1,5-10H2
46 atoms
O  2.346283 0.041127 -1.522812
O  -1.286712 -2.447087 -0.14376
O  3.582282 -1.822581 -0.039856
O  3.868412 2.461697 -0.74962
N  -2.503089 -0.182678 0.031088
C  0.269244 -0.602902 -0.608733
C  -0.462925 -1.443661 0.450839
C  -1.491899 -0.499397 1.118222
C  1.603151 -1.134863 -1.188554
C  -0.72523 -0.203958 -1.7108
C  0.813841 0.6318 0.050898
C  0.496126 -2.070064 1.454112
C  -0.919077 0.748025 1.803869
C  -1.904964 0.556477 -1.130285
C  0.281839 1.335438 1.101999
C  1.583446 -2.873374 0.730565
C  2.398904 -1.953324 -0.151905
C  1.992434 0.963746 -0.571768
C  -3.754476 0.473994 0.539467
C  0.9792 2.479037 1.491629
C  2.702669 2.089085 -0.193988
C  2.151131 2.847086 0.84368
C  -4.8914 0.287276 -0.41391
C  -5.510252 1.290837 -1.013533
H  -2.056325 -1.086039 1.844211
H  1.482592 -1.727168 -2.09791
H  -1.069716 -1.089824 -2.245401
H  -0.230192 0.444969 -2.433429
H  -0.065877 -2.709121 2.137197
H  0.973186 -1.29225 2.052071
H  -0.63358 0.44309 2.813523
H  -1.707954 1.488687 1.950312
H  -1.604533 1.534796 -0.757286
H  -2.698744 0.693141 -1.861374
H  1.151308 -3.671511 0.115794
H  2.256951 -3.351791 1.437907
H  -0.795271 -3.254432 -0.294541
H  -3.537006 1.528878 0.69548
H  -3.974857 0.017041 1.505216
H  0.628504 3.082227 2.32004
H  2.694545 3.726689 1.163076
H  -5.229648 -0.733464 -0.570404
H  4.181859 1.782755 -1.351817
H  -6.35359 1.119476 -1.668798
H  -5.209778 2.321116 -0.859532
H  -2.760759 -1.110249 -0.317862
totalener: -1092.77491823 hartree
nucrepener: 2277.58017347 hartree
electener: -3370.35509171 hartree
oneelecener: -5992.04578055 hartree
twoeener: 2621.69068884 hartree
kineticenergy: 1087.19228872 hartree
xcener: -105.136394047742 hartree
chargesum: 1.0000000
charge: -0.321253 -0.362081 -0.242504 -0.266139 0.204522 0.529252 0.220528 -0.029427 0.176309 -0.264682 -0.180804 -0.230445 -0.291791 -0.229860 -0.199395 -0.166228 0.135592 0.039300 -0.063757 -0.086949 0.162708 -0.167939 -0.235654 -0.143175 0.153477 0.117923 0.122996 0.130863 0.121414 0.120479 0.129033 0.128620 0.163695 0.159447 0.088696 0.116875 0.187555 0.122536 0.144312 0.126891 0.136602 0.136511 0.204988 0.137341 0.108724 0.154894
charge: 0.296096 0.319754 0.198128 0.380046 0.463396 -0.112130 -0.214367 -0.022009 -0.098827 0.015696 -0.072753 0.010901 0.013778 0.028853 -0.093829 0.000672 -0.250681 -0.185692 -0.002909 -0.001098 -0.192586 0.021574 -0.054099 0.077332 0.043780 0.040934 0.029575 0.049941 0.036007 0.044569 0.046848 0.034481 0.039188 0.034596 0.026818 0.044153 -0.127611 0.037501 0.038739 0.027536 0.035109 0.023437 -0.095202 0.021448 0.015518 0.027387
qa: -0.3213 -0.3621 -0.2425 -0.2661 0.2045 0.5293 0.2205 -0.0294 0.1763 -0.2647 -0.1808 -0.2304 -0.2918 -0.2299 -0.1994 -0.1662 0.1356 0.0393 -0.0638 -0.0869 0.1627 -0.1679 -0.2357 -0.1432 0.1535 0.1179 0.1230 0.1309 0.1214 0.1205 0.1290 0.1286 0.1637 0.1594 0.0887 0.1169 0.1876 0.1225 0.1443 0.1269 0.1366 0.1365 0.2050 0.1373 0.1087 0.1549
va: 2.1186 2.0910 2.2150 2.2254 3.5983 3.3038 4.0551 3.8462 3.8011 3.8831 3.4209 3.8773 4.0106 3.8648 3.7306 3.8367 4.0736 3.8902 3.8547 3.9995 4.1940 4.0098 3.8341 3.9585 1.0028 0.9868 1.0221 1.0182 1.0126 0.9998 0.9928 0.9978 0.9869 1.0095 1.0208 1.0336 1.0622 1.0029 0.9938 1.0018 1.0088 1.0103 1.0372 1.0069 1.0143 1.0453
dispcorr: -0.029020861 hartree
energy: -1092.807071958318
dipole: -24.41849 20.05367 -4.36482 -1.90769 1.05446 -0.85323 3.57163 -3.35222 0.21940
magnitude: 4.45284 au
magnitude: 11.31822 debye
temp: 298.15 k
press: 1.00 atm
zeropoint: 0.39280061 hartree
thermalvibcorrection: 0.01686078 hartree
thermalrotcorrection: 0.00141627 hartree
thermaltrasncorrection: 0.00141627 hartree
thermaltotal: -1092.39457802 hartree
thermalcorr: 0.01969333 hartree
nonthermalcorr: 0.39280061 hartree
totalcorr: 0.41249393 hartree
thermalcorrenthalpy: 0.00094421 hartree
totalenthalpy: -1092.39363381 hartree
totalentropycorr: -0.06534523 hartree
gibbsenthalpy: -1092.45897905 hartree
gibbsminuselec: 0.34809291 hartree
