program: Orca
programVersion: 5.0.3
elementType: Cl F N N N C C C C C C C C C C C C C C C C C C H H H H H H H H H H H H H H
charge: 1
multiplicity: 1
keywords: wB97X-D3 TightOpt Freq def2-TZVPP def2/J RIJCOSX TightSCF defgrid3 CHELPG
frequency: 0.00 0.00 0.00 0.00 0.00 0.00 32.16 36.38 57.41 64.87 103.87 113.90 154.33 155.64 170.73 199.30 235.41 243.60 258.68 292.81 306.56 324.26 333.22 364.00 418.99 439.91 454.53 479.42 491.52 516.32 527.73 548.28 566.81 573.96 610.11 651.96 663.77 680.35 687.43 705.88 720.61 733.87 771.87 789.11 800.38 810.28 831.10 850.38 856.23 870.45 911.32 952.33 971.49 1004.82 1007.13 1009.96 1016.03 1043.67 1045.15 1056.85 1069.36 1073.58 1085.69 1125.97 1139.87 1147.33 1172.90 1184.97 1202.83 1234.18 1255.42 1278.39 1290.98 1297.55 1312.86 1322.82 1330.94 1355.92 1364.61 1373.73 1418.00 1439.62 1456.50 1474.12 1482.60 1503.39 1509.53 1540.05 1545.75 1581.63 1616.37 1652.51 1662.27 1678.24 1697.25 1707.70 1735.09 3049.83 3081.88 3156.59 3158.82 3179.74 3214.75 3223.00 3223.50 3228.08 3233.86 3239.66 3241.59 3315.20 3680.50
frequency: 32.16 36.38 57.41 64.87 103.87 113.90 154.33 155.64 170.73 199.30 235.41 243.60 258.68 292.81 306.56 324.26 333.22 364.00 418.99 439.91 454.53 479.42 491.52 516.32 527.73 548.28 566.81 573.96 610.11 651.96 663.77 680.35 687.43 705.88 720.61 733.87 771.87 789.11 800.38 810.28 831.10 850.38 856.23 870.45 911.32 952.33 971.49 1004.82 1007.13 1009.96 1016.03 1043.67 1045.15 1056.85 1069.36 1073.58 1085.69 1125.97 1139.87 1147.33 1172.90 1184.97 1202.83 1234.18 1255.42 1278.39 1290.98 1297.55 1312.86 1322.82 1330.94 1355.92 1364.61 1373.73 1418.00 1439.62 1456.50 1474.12 1482.60 1503.39 1509.53 1540.05 1545.75 1581.63 1616.37 1652.51 1662.27 1678.24 1697.25 1707.70 1735.09 3049.83 3081.88 3156.59 3158.82 3179.74 3214.75 3223.00 3223.50 3228.08 3233.86 3239.66 3241.59 3315.20 3680.50
formula: C18H14ClFN3
InChI: InChI=1S/C18H14ClFN3/c1-11-21-9-13-10-22-18(14-4-2-3-5-16(14)20)15-8-12(19)6-7-17(15)23(11)13/h2-9,21H,10H2,1H3
37 atoms
Cl -1.403112 4.16895 -0.504235
F  -1.200345 -0.38748 1.901455
N  2.267099 -0.426759 -0.043973
N  0.053118 -1.769717 -1.52623
N  3.770856 -1.795119 0.614777
C  1.374178 0.68515 -0.158696
C  2.34958 -1.430078 -1.004877
C  0.041142 0.454897 -0.495305
C  1.35283 -1.459026 -2.106315
C  -0.509405 -0.908659 -0.7802
C  3.130668 -0.675329 0.94489
C  3.301942 -2.288159 -0.584079
C  1.854266 1.968692 0.048352
C  -0.80792 1.551237 -0.589756
C  -1.834731 -1.240083 -0.20183
C  3.331628 0.099327 2.191266
C  1.000562 3.049559 -0.052883
C  -0.332552 2.833084 -0.371857
C  -2.143432 -0.954249 1.121582
C  -2.807267 -1.876112 -0.970541
C  -3.364137 -1.25891 1.683335
C  -4.042889 -2.186241 -0.432526
C  -4.320318 -1.874895 0.891705
H  1.351349 -0.501009 -2.637876
H  1.617137 -2.23751 -2.817662
H  3.665378 -3.203557 -1.015016
H  2.901099 2.131976 0.26589
H  -1.850567 1.399923 -0.83506
H  4.080933 0.879694 2.056429
H  2.397206 0.566917 2.495891
H  3.667239 -0.562406 2.987494
H  1.365656 4.055065 0.101464
H  -2.574627 -2.117056 -1.999293
H  -3.546513 -1.02191 2.722363
H  -4.791143 -2.670607 -1.044687
H  -5.285621 -2.117657 1.315826
H  4.480553 -2.224609 1.184513
totalener: -1418.50778385 hartree
nucrepener: 2013.62514162 hartree
electener: -3432.13292547 hartree
oneelecener: -5918.91244899 hartree
twoeener: 2486.77952352 hartree
kineticenergy: 1413.00479171 hartree
xcener: -113.510906154059 hartree
chargesum: 1.0000000
charge: 0.000634 -0.215760 0.025562 -0.228601 -0.127862 0.028690 -0.083313 -0.093154 0.039769 0.247620 0.239596 0.033746 -0.154736 -0.076840 -0.185439 -0.213924 -0.072686 0.048411 0.297426 -0.111055 -0.186466 -0.158804 -0.053880 0.132283 0.103645 0.191562 0.150886 0.152642 0.125020 0.143044 0.112834 0.143792 0.131615 0.136432 0.143205 0.147097 0.187012
charge: 0.467891 0.191231 0.373453 0.200680 0.421797 -0.103034 -0.106851 -0.050284 -0.065227 -0.143521 -0.129232 -0.011742 0.012087 0.018739 -0.086754 0.051045 -0.000917 -0.382418 -0.201664 0.029750 0.000228 -0.002451 0.018620 0.037495 0.040455 0.030010 0.033774 0.043455 0.040267 0.046864 0.039651 0.036562 0.033656 0.032676 0.028834 0.031849 0.023027
qa: 0.0006 -0.2158 0.0256 -0.2286 -0.1279 0.0287 -0.0833 -0.0932 0.0398 0.2476 0.2396 0.0337 -0.1547 -0.0768 -0.1854 -0.2139 -0.0727 0.0484 0.2974 -0.1111 -0.1865 -0.1588 -0.0539 0.1323 0.1036 0.1916 0.1509 0.1526 0.1250 0.1430 0.1128 0.1438 0.1316 0.1364 0.1432 0.1471 0.1870
va: 1.3094 1.0711 3.4681 2.9889 3.5709 3.7505 3.9177 3.6946 3.9251 3.7183 3.7894 3.9122 4.0052 3.9469 3.5121 3.9414 4.0180 4.0835 3.8980 3.9708 4.0124 4.0105 3.9048 0.9972 1.0022 0.9878 0.9971 1.0078 0.9933 0.9919 1.0106 1.0086 1.0248 1.0092 1.0008 0.9947 1.0043
dispcorr: -0.019244576 hartree
energy: -1418.530104983504
dipole: 10.33878 -6.32201 4.01677 -12.76531 11.52434 -1.24097 1.60991 -0.84462 0.76529
magnitude: 4.27318 au
magnitude: 10.86157 debye
temp: 298.15 k
press: 1.00 atm
zeropoint: 0.28947464 hartree
thermalvibcorrection: 0.01523515 hartree
thermalrotcorrection: 0.00141627 hartree
thermaltrasncorrection: 0.00141627 hartree
thermaltotal: -1418.22256265 hartree
thermalcorr: 0.01806769 hartree
nonthermalcorr: 0.28947464 hartree
totalcorr: 0.30754233 hartree
thermalcorrenthalpy: 0.00094421 hartree
totalenthalpy: -1418.22161844 hartree
totalentropycorr: -0.06329891 hartree
gibbsenthalpy: -1418.28491735 hartree
gibbsminuselec: 0.24518763 hartree
