program: Orca
programVersion: 5.0.3
elementType: Cl F N N N C C C C C C C C C C C C C C C C C C H H H H H H H H H H H H H H
charge: 1
multiplicity: 1
keywords: wB97X-D3 TightOpt Freq def2-TZVPP def2/J RIJCOSX TightSCF defgrid3 CHELPG
frequency: 0.00 0.00 0.00 0.00 0.00 0.00 28.46 39.72 62.47 65.89 105.12 114.03 150.49 153.85 161.02 197.30 230.48 246.50 250.25 301.03 316.10 322.71 342.98 362.18 424.08 443.60 449.66 469.80 491.11 515.37 522.58 552.14 569.59 573.99 609.83 651.23 664.15 679.71 689.64 706.17 719.84 735.42 770.32 788.90 798.99 808.69 829.46 851.49 859.99 871.07 908.47 954.62 970.57 997.70 1006.33 1010.63 1015.93 1038.64 1045.86 1055.76 1068.32 1078.28 1084.19 1124.72 1141.84 1154.25 1174.60 1185.07 1203.13 1233.38 1278.31 1283.67 1292.65 1300.33 1313.05 1321.07 1329.00 1353.32 1364.57 1373.07 1417.61 1440.10 1454.90 1474.61 1482.26 1503.52 1506.06 1538.82 1552.36 1579.60 1615.75 1648.77 1661.72 1676.80 1694.83 1707.65 1740.09 3047.73 3082.03 3155.15 3158.06 3180.89 3195.77 3216.65 3223.96 3230.94 3231.37 3238.56 3241.29 3315.18 3679.70
frequency: 28.46 39.72 62.47 65.89 105.12 114.03 150.49 153.85 161.02 197.30 230.48 246.50 250.25 301.03 316.10 322.71 342.98 362.18 424.08 443.60 449.66 469.80 491.11 515.37 522.58 552.14 569.59 573.99 609.83 651.23 664.15 679.71 689.64 706.17 719.84 735.42 770.32 788.90 798.99 808.69 829.46 851.49 859.99 871.07 908.47 954.62 970.57 997.70 1006.33 1010.63 1015.93 1038.64 1045.86 1055.76 1068.32 1078.28 1084.19 1124.72 1141.84 1154.25 1174.60 1185.07 1203.13 1233.38 1278.31 1283.67 1292.65 1300.33 1313.05 1321.07 1329.00 1353.32 1364.57 1373.07 1417.61 1440.10 1454.90 1474.61 1482.26 1503.52 1506.06 1538.82 1552.36 1579.60 1615.75 1648.77 1661.72 1676.80 1694.83 1707.65 1740.09 3047.73 3082.03 3155.15 3158.06 3180.89 3195.77 3216.65 3223.96 3230.94 3231.37 3238.56 3241.29 3315.18 3679.70
formula: C18H14ClFN3
InChI: InChI=1S/C18H14ClFN3/c1-11-21-9-13-10-22-18(14-4-2-3-5-16(14)20)15-8-12(19)6-7-17(15)23(11)13/h2-9,21H,10H2,1H3
37 atoms
Cl -0.707383 4.386252 -0.527781
F  -3.008169 -1.782793 -1.692706
N  2.258067 -0.688212 0.019142
N  -0.243455 -1.765721 -1.203864
N  3.61232 -2.216337 0.65351
C  1.528006 0.536598 -0.111882
C  2.113305 -1.751812 -0.867138
C  0.151537 0.497335 -0.343616
C  1.037752 -1.700155 -1.888916
C  -0.625309 -0.77641 -0.505816
C  3.169836 -0.99589 0.947616
C  2.970762 -2.711081 -0.461483
C  2.210969 1.741286 -0.0340
C  -0.523141 1.7084 -0.459827
C  -1.93569 -0.845459 0.187542
C  3.607294 -0.179961 2.104363
C  1.527181 2.934651 -0.156397
C  0.155779 2.911227 -0.368334
C  -3.066053 -1.380793 -0.424271
C  -2.06683 -0.388888 1.499703
C  -4.277578 -1.474263 0.233313
C  -3.266076 -0.487597 2.179112
C  -4.372437 -1.032081 1.541152
H  1.136963 -0.791059 -2.492621
H  1.125737 -2.555066 -2.554929
H  3.162179 -3.694557 -0.851233
H  3.284497 1.752577 0.096723
H  -1.591532 1.70801 -0.627549
H  4.456296 0.452292 1.84291
H  2.795804 0.459868 2.444812
H  3.906869 -0.830922 2.923623
H  2.052809 3.877578 -0.102375
H  -1.205888 0.043694 1.995593
H  -5.12714 -1.888376 -0.292068
H  -3.341417 -0.138096 3.199583
H  -5.317929 -1.106595 2.061879
H  4.306628 -2.706709 1.192346
totalener: -1418.50259008 hartree
nucrepener: 1989.36929890 hartree
electener: -3407.87188898 hartree
oneelecener: -5870.30892880 hartree
twoeener: 2462.43703981 hartree
kineticenergy: 1412.99794952 hartree
xcener: -113.509335515622 hartree
chargesum: 1.0000000
charge: 0.003995 -0.176568 0.027260 -0.210546 -0.127028 0.041618 -0.087968 -0.127355 0.042948 0.239446 0.238507 0.035044 -0.161947 -0.083246 -0.168129 -0.216192 -0.073250 0.054017 0.297799 -0.115550 -0.203618 -0.176150 -0.046475 0.132048 0.103462 0.192814 0.151278 0.152043 0.127065 0.136941 0.115442 0.145039 0.125365 0.138516 0.138560 0.147537 0.187279
charge: 0.470351 0.224290 0.372061 0.205617 0.422096 -0.103530 -0.106247 -0.050224 -0.065583 -0.147487 -0.131405 -0.010917 0.010580 0.019461 -0.085508 0.049534 -0.000785 -0.384130 -0.201684 0.006938 0.006737 -0.010489 0.017233 0.038250 0.041769 0.030572 0.033899 0.044800 0.041000 0.044145 0.039932 0.037047 0.025620 0.034533 0.026236 0.031868 0.023420
qa: 0.0040 -0.1766 0.0273 -0.2105 -0.1270 0.0416 -0.0880 -0.1274 0.0429 0.2394 0.2385 0.0350 -0.1619 -0.0832 -0.1681 -0.2162 -0.0732 0.0540 0.2978 -0.1155 -0.2036 -0.1762 -0.0465 0.1320 0.1035 0.1928 0.1513 0.1520 0.1271 0.1369 0.1154 0.1450 0.1254 0.1385 0.1386 0.1475 0.1873
va: 1.3127 1.1310 3.4641 3.0022 3.5718 3.7177 3.9310 3.7214 3.9329 3.7394 3.7866 3.9094 3.9967 3.9359 3.4303 3.9427 4.0169 4.0768 4.0383 3.9021 3.9900 4.0419 3.8832 0.9960 1.0028 0.9873 0.9969 1.0095 0.9930 0.9922 1.0100 1.0084 1.0022 1.0084 1.0023 0.9944 1.0041
dispcorr: -0.018968050 hartree
energy: -1418.524656052260
dipole: 13.26940 -8.78977 4.47963 -9.67605 8.41376 -1.26228 10.98098 -9.37807 1.60291
magnitude: 4.92238 au
magnitude: 12.51169 debye
temp: 298.15 k
press: 1.00 atm
zeropoint: 0.28944461 hartree
thermalvibcorrection: 0.01523943 hartree
thermalrotcorrection: 0.00141627 hartree
thermaltrasncorrection: 0.00141627 hartree
thermaltotal: -1418.21713947 hartree
thermalcorr: 0.01807197 hartree
nonthermalcorr: 0.28944461 hartree
totalcorr: 0.30751658 hartree
thermalcorrenthalpy: 0.00094421 hartree
totalenthalpy: -1418.21619527 hartree
totalentropycorr: -0.06341606 hartree
gibbsenthalpy: -1418.27961133 hartree
gibbsminuselec: 0.24504472 hartree
