program: Orca
programVersion: 5.0.3
elementType: C O C O C C C O P O O C O C H H H H H H H H H H H H H H
charge: 1
multiplicity: 1
keywords: wB97X-D3 TightOpt Freq def2-TZVPP def2/J RIJCOSX TightSCF defgrid3
frequency: 0.00 0.00 0.00 0.00 0.00 0.00 31.01 53.81 70.11 90.50 94.89 101.55 110.66 126.36 133.11 151.85 159.02 186.71 192.07 221.74 239.03 284.05 294.66 316.60 370.07 418.06 473.37 487.94 532.39 554.67 605.66 658.46 743.56 775.20 835.59 870.43 904.53 915.55 964.61 1035.96 1071.69 1074.71 1096.58 1126.89 1138.40 1179.35 1186.50 1187.73 1207.68 1214.59 1218.26 1228.44 1259.63 1339.18 1395.89 1425.57 1469.38 1474.32 1479.23 1485.45 1491.46 1494.60 1496.96 1498.75 1500.61 1503.45 1507.02 1509.04 1582.46 1724.68 1751.06 3071.78 3086.89 3087.78 3099.49 3141.51 3180.77 3183.81 3192.03 3195.66 3212.50 3213.75 3228.69 3245.19
frequency: 31.01 53.81 70.11 90.50 94.89 101.55 110.66 126.36 133.11 151.85 159.02 186.71 192.07 221.74 239.03 284.05 294.66 316.60 370.07 418.06 473.37 487.94 532.39 554.67 605.66 658.46 743.56 775.20 835.59 870.43 904.53 915.55 964.61 1035.96 1071.69 1074.71 1096.58 1126.89 1138.40 1179.35 1186.50 1187.73 1207.68 1214.59 1218.26 1228.44 1259.63 1339.18 1395.89 1425.57 1469.38 1474.32 1479.23 1485.45 1491.46 1494.60 1496.96 1498.75 1500.61 1503.45 1507.02 1509.04 1582.46 1724.68 1751.06 3071.78 3086.89 3087.78 3099.49 3141.51 3180.77 3183.81 3192.03 3195.66 3212.50 3213.75 3228.69 3245.19
formula: C7H14O6P
InChI: InChI=1S/C7H14O6P/c1-6-5-7(8-2)12-15-13-14(9-3,10-4)11-6/h5H,1-4H3
28 atoms
C  -4.15689 -0.999112 -1.465581
O  -3.517686 0.097613 -0.767665
C  -2.314788 -0.057498 -0.331267
O  -1.716208 -1.136711 -0.545745
C  -1.815634 1.098122 0.402657
C  -0.553684 1.522834 0.535079
C  -0.17258 2.76182 1.259911
O  0.515516 0.90517 -0.069472
P  1.296863 -0.371265 0.49924
O  0.333575 -1.490767 0.644816
O  2.448007 -0.557514 -0.510632
C  2.261881 -1.083759 -1.844597
O  1.952278 -0.002871 1.842829
C  3.169981 0.76664 1.982154
H  -5.156139 -0.642938 -1.685649
H  -4.18425 -1.874137 -0.82119
H  -3.609803 -1.217159 -2.379072
H  -2.59302 1.725807 0.812746
H  -1.041566 3.274734 1.661277
H  0.363137 3.429677 0.584089
H  0.499909 2.509829 2.082438
H  3.257347 -1.237709 -2.245965
H  1.720781 -0.357925 -2.448222
H  1.725496 -2.028974 -1.793896
H  3.284002 0.947414 3.045374
H  3.083708 1.708862 1.443202
H  4.006953 0.187278 1.602343
H  -0.768774 -1.316583 0.014563
totalener: -1067.84385045 hartree
nucrepener: 1174.27576764 hartree
electener: -2242.11961809 hartree
oneelecener: -3781.35189701 hartree
twoeener: 1539.23227892 hartree
kineticenergy: 1064.18720806 hartree
xcener: -83.023881324518 hartree
chargesum: 1.0000000
charge: -0.117672 -0.191887 0.502493 -0.302538 -0.217852 0.241743 -0.193983 -0.324276 0.903192 -0.430389 -0.281502 -0.132811 -0.293563 -0.137155 0.148873 0.135516 0.131500 0.133610 0.108083 0.124258 0.108578 0.142081 0.130921 0.133451 0.148160 0.122931 0.142511 0.265731
charge: 0.030308 0.371999 -0.342021 0.391607 -0.021515 -0.173430 0.045737 0.180903 0.154800 0.011443 0.140613 -0.010134 0.145188 -0.013626 0.022978 0.018916 0.017727 0.047227 0.037178 0.040533 0.035374 0.022671 0.009949 0.012684 0.021942 0.006972 0.015156 -0.221180
qa: -0.1177 -0.1919 0.5025 -0.3025 -0.2179 0.2417 -0.1940 -0.3243 0.9032 -0.4304 -0.2815 -0.1328 -0.2936 -0.1372 0.1489 0.1355 0.1315 0.1336 0.1081 0.1243 0.1086 0.1421 0.1309 0.1335 0.1482 0.1229 0.1425 0.2657
va: 3.8058 2.2811 4.0798 2.2293 3.9248 3.8664 3.9522 2.1416 5.6153 2.1642 2.1944 3.8211 2.2134 3.8164 0.9906 0.9939 0.9919 1.0215 1.0148 0.9972 1.0019 0.9907 0.9858 0.9889 0.9854 0.9851 0.9939 1.1075
dispcorr: -0.011441018 hartree
energy: -1067.859351076390
dipole: -0.49696 0.14004 -0.35691 4.71705 -3.82826 0.88879 -2.27168 1.65217 -0.61951
magnitude: 1.14067 au
magnitude: 2.89935 debye
temp: 298.15 k
press: 1.00 atm
zeropoint: 0.22203751 hartree
thermalvibcorrection: 0.01413807 hartree
thermalrotcorrection: 0.00141627 hartree
thermaltrasncorrection: 0.00141627 hartree
thermaltotal: -1067.62034295 hartree
thermalcorr: 0.01697061 hartree
nonthermalcorr: 0.22203751 hartree
totalcorr: 0.23900813 hartree
thermalcorrenthalpy: 0.00094421 hartree
totalenthalpy: -1067.61939874 hartree
totalentropycorr: -0.06117110 hartree
gibbsenthalpy: -1067.68056984 hartree
gibbsminuselec: 0.17878123 hartree
