program: Orca
programVersion: 5.0.3
elementType: C O C O C C C O P O O C O C H H H H H H H H H H H H H H
charge: 1
multiplicity: 1
keywords: wB97X-D3 TightOpt Freq def2-TZVPP def2/J RIJCOSX TightSCF defgrid3 CHELPG
frequency: 0.00 0.00 0.00 0.00 0.00 0.00 17.56 31.05 60.74 66.40 86.88 93.41 100.95 109.01 129.88 149.33 161.63 184.40 192.09 210.50 235.60 264.42 319.12 336.78 353.56 408.96 425.42 473.91 499.48 530.97 539.72 594.10 707.86 733.86 756.34 803.65 867.44 894.72 906.91 951.22 1051.58 1057.97 1117.65 1130.46 1134.07 1171.15 1179.26 1187.66 1189.08 1212.08 1216.77 1223.18 1297.78 1378.40 1397.98 1426.08 1444.27 1480.17 1486.52 1493.22 1493.84 1497.42 1501.71 1504.03 1506.17 1506.88 1514.27 1543.47 1613.33 1636.39 3067.51 3083.62 3084.02 3086.67 3158.10 3158.96 3175.58 3176.03 3198.81 3206.06 3206.48 3215.80 3232.79 3843.96
frequency: 17.56 31.05 60.74 66.40 86.88 93.41 100.95 109.01 129.88 149.33 161.63 184.40 192.09 210.50 235.60 264.42 319.12 336.78 353.56 408.96 425.42 473.91 499.48 530.97 539.72 594.10 707.86 733.86 756.34 803.65 867.44 894.72 906.91 951.22 1051.58 1057.97 1117.65 1130.46 1134.07 1171.15 1179.26 1187.66 1189.08 1212.08 1216.77 1223.18 1297.78 1378.40 1397.98 1426.08 1444.27 1480.17 1486.52 1493.22 1493.84 1497.42 1501.71 1504.03 1506.17 1506.88 1514.27 1543.47 1613.33 1636.39 3067.51 3083.62 3084.02 3086.67 3158.10 3158.96 3175.58 3176.03 3198.81 3206.06 3206.48 3215.80 3232.79 3843.96
formula: C7H14O6P
InChI: InChI=1S/C7H14O6P/c1-6(5-7(8)10-2)13-14(9,11-3)12-4/h5,8H,1-4H3
28 atoms
C  -4.88797 0.340134 0.082366
O  -3.454519 0.482799 0.128412
C  -2.668876 -0.486635 -0.224644
O  -3.147494 -1.629136 -0.628572
C  -1.276935 -0.372197 -0.195163
C  -0.589782 0.756332 0.177619
C  -1.182799 2.0520 0.613397
O  0.726922 0.791943 0.178769
P  1.824014 -0.427742 -0.158401
O  1.324466 -1.325598 -1.180961
O  3.081028 0.43742 -0.442857
C  3.341338 1.006759 -1.742711
O  2.069692 -1.051562 1.237158
C  2.764675 -0.401211 2.31783
H  -5.279576 1.291264 0.424125
H  -5.211739 -0.449182 0.761543
H  -5.217504 0.159952 -0.941393
H  -0.732032 -1.241594 -0.533805
H  -1.788256 1.909679 1.508266
H  -1.837306 2.452947 -0.159538
H  -0.388779 2.762013 0.822736
H  4.387034 1.295339 -1.742416
H  2.712453 1.883863 -1.886295
H  3.151665 0.266799 -2.517161
H  2.747978 -1.099908 3.147507
H  2.252537 0.519882 2.592878
H  3.78922 -0.189433 2.022483
H  -4.10895 -1.679235 -0.640317
totalener: -1067.81895886 hartree
nucrepener: 1130.76892502 hartree
electener: -2198.58788388 hartree
oneelecener: -3695.68477559 hartree
twoeener: 1497.09689171 hartree
kineticenergy: 1063.55787152 hartree
xcener: -82.883766874820 hartree
chargesum: 1.0000000
charge: -0.157421 -0.216162 0.474750 -0.169096 -0.224428 0.281431 -0.184617 -0.271813 0.851197 -0.473435 -0.301740 -0.124336 -0.286774 -0.118671 0.141767 0.137951 0.138675 0.165078 0.110558 0.111101 0.122247 0.135758 0.116250 0.137406 0.137350 0.111823 0.131490 0.223662
charge: 0.017885 0.363575 -0.294043 0.476414 -0.039842 -0.152045 0.048471 0.213061 0.137193 -0.188747 0.125585 -0.020760 0.134607 -0.026811 0.033501 0.018449 0.018625 0.031956 0.037921 0.037073 0.035117 0.018432 0.006663 0.013295 0.018282 0.003735 0.010964 -0.078556
qa: -0.1574 -0.2162 0.4747 -0.1691 -0.2244 0.2814 -0.1846 -0.2718 0.8512 -0.4734 -0.3017 -0.1243 -0.2868 -0.1187 0.1418 0.1380 0.1387 0.1651 0.1106 0.1111 0.1222 0.1358 0.1163 0.1374 0.1374 0.1118 0.1315 0.2237
va: 3.8367 2.2367 4.1013 2.3784 3.7569 3.8588 3.9052 2.2196 5.6394 2.1470 2.1603 3.8270 2.1733 3.8293 0.9996 0.9833 0.9833 1.0505 1.0057 1.0066 1.0157 0.9899 0.9894 0.9905 0.9887 0.9908 0.9922 1.0342
dispcorr: -0.010472427 hartree
energy: -1067.833694516549
dipole: -7.15733 3.70563 -3.45170 8.13942 -6.76401 1.37542 2.86755 -2.23882 0.62874
magnitude: 3.76846 au
magnitude: 9.57867 debye
temp: 298.15 k
press: 1.00 atm
zeropoint: 0.22482115 hartree
thermalvibcorrection: 0.01465921 hartree
thermalrotcorrection: 0.00141627 hartree
thermaltrasncorrection: 0.00141627 hartree
thermaltotal: -1067.59138161 hartree
thermalcorr: 0.01749176 hartree
nonthermalcorr: 0.22482115 hartree
totalcorr: 0.24231290 hartree
thermalcorrenthalpy: 0.00094421 hartree
totalenthalpy: -1067.59043740 hartree
totalentropycorr: -0.06258541 hartree
gibbsenthalpy: -1067.65302281 hartree
gibbsminuselec: 0.18067170 hartree
