program: Orca
programVersion: 5.0.3
elementType: C N C O O C C C C C S C C C C H H H H H H H H H H H H H H H H
charge: 1
multiplicity: 1
keywords: wB97X-D3 TightOpt Freq def2-TZVPP def2/J RIJCOSX TightSCF defgrid3 CHELPG
frequency: 0.00 0.00 0.00 0.00 0.00 0.00 -10.80 6.18 31.18 49.55 55.95 100.46 124.49 130.85 151.87 165.13 186.25 208.29 230.52 260.38 267.85 306.29 323.77 367.71 424.75 501.59 522.85 526.41 544.06 549.55 562.37 618.30 628.26 629.27 734.22 757.06 773.88 774.91 887.05 898.97 930.63 970.84 981.65 996.90 998.87 1036.84 1058.86 1066.48 1069.86 1098.56 1141.48 1160.33 1175.82 1206.99 1245.43 1250.89 1304.53 1317.99 1369.91 1420.60 1428.91 1430.18 1455.08 1463.32 1471.10 1472.44 1478.28 1483.30 1487.55 1495.61 1502.63 1511.25 1514.41 1602.89 1660.29 1667.54 1766.32 3075.49 3079.52 3079.85 3096.38 3150.54 3151.22 3165.47 3166.04 3167.19 3176.99 3180.21 3207.81 3215.91 3216.93 3656.56 3705.88
frequency: 6.18 31.18 49.55 55.95 100.46 124.49 130.85 151.87 165.13 186.25 208.29 230.52 260.38 267.85 306.29 323.77 367.71 424.75 501.59 522.85 526.41 544.06 549.55 562.37 618.30 628.26 629.27 734.22 757.06 773.88 774.91 887.05 898.97 930.63 970.84 981.65 996.90 998.87 1036.84 1058.86 1066.48 1069.86 1098.56 1141.48 1160.33 1175.82 1206.99 1245.43 1250.89 1304.53 1317.99 1369.91 1420.60 1428.91 1430.18 1455.08 1463.32 1471.10 1472.44 1478.28 1483.30 1487.55 1495.61 1502.63 1511.25 1514.41 1602.89 1660.29 1667.54 1766.32 3075.49 3079.52 3079.85 3096.38 3150.54 3151.22 3165.47 3166.04 3167.19 3176.99 3180.21 3207.81 3215.91 3216.93 3656.56 3705.88
formula: C11H16NO2S
InChI: InChI=1S/C11H16NO2S/c1-7-5-9(14-11(13)12-3)6-8(2)10(7)15-4/h5-6,12-13H,1-4H3
31 atoms
C  -4.98334 0.099736 1.152871
N  -4.407201 0.017697 -0.188758
C  -3.127462 0.001104 -0.427332
O  -2.730508 -0.074235 -1.659268
O  -2.31327 0.060667 0.577068
C  -0.910493 0.035039 0.311118
C  -0.265978 1.23359 0.108059
C  1.106651 1.220701 -0.130891
C  1.817943 2.523296 -0.356317
C  1.780401 -0.01132 -0.150188
S  3.525322 -0.044098 -0.494565
C  4.184672 0.047428 1.184706
C  1.0966 -1.220377 0.05848
C  1.796639 -2.547997 0.0333
C  -0.275637 -1.1854 0.296156
H  -6.062709 0.050884 1.053442
H  -4.7068 1.03875 1.627239
H  -4.639835 -0.733221 1.761853
H  -5.011645 -0.025917 -0.99376
H  -0.813206 2.166696 0.149777
H  1.122196 3.359177 -0.31614
H  2.32073 2.530647 -1.322433
H  2.58803 2.68421 0.397759
H  5.268027 0.029675 1.08385
H  3.87232 -0.806648 1.781821
H  3.89141 0.97244 1.676477
H  2.3026 -2.702695 -0.918734
H  1.09315 -3.362551 0.194243
H  2.562405 -2.602717 0.806708
H  -0.830601 -2.096575 0.479047
H  -1.76128 -0.077738 -1.719625
totalener: -1032.04981717 hartree
nucrepener: 1111.72682271 hartree
electener: -2143.77663987 hartree
oneelecener: -3601.38821735 hartree
twoeener: 1457.61157747 hartree
kineticenergy: 1028.04674345 hartree
xcener: -80.601677133839 hartree
chargesum: 1.0000000
charge: -0.128246 -0.152896 0.540917 -0.208429 -0.225904 0.138447 -0.210892 0.134565 -0.187945 -0.208699 -0.059612 -0.256561 0.130896 -0.189967 -0.203558 0.124775 0.133446 0.131370 0.196852 0.135773 0.086914 0.117023 0.104779 0.135116 0.105771 0.106036 0.117617 0.087135 0.105458 0.134426 0.265393
charge: 0.043372 0.375947 -0.394168 0.456600 0.393808 -0.180241 -0.006341 -0.076211 0.026295 -0.279690 0.626620 -0.188508 -0.075642 0.026730 -0.005219 0.029367 0.025933 0.025924 0.018524 0.033051 0.021221 0.029776 0.028226 0.008142 -0.008135 -0.007656 0.029875 0.021345 0.027723 0.033107 -0.059774
qa: -0.1282 -0.1529 0.5409 -0.2084 -0.2259 0.1384 -0.2109 0.1346 -0.1879 -0.2087 -0.0596 -0.2566 0.1309 -0.1900 -0.2036 0.1248 0.1334 0.1314 0.1969 0.1358 0.0869 0.1170 0.1048 0.1351 0.1058 0.1060 0.1176 0.0871 0.1055 0.1344 0.2654
va: 3.8444 3.3748 4.2034 2.3135 2.2380 3.7178 4.0907 3.5833 3.9249 4.0800 2.2625 3.9853 3.5868 3.9232 4.0967 0.9970 0.9937 0.9942 1.0018 1.0111 1.0088 1.0012 1.0008 1.0004 1.0006 1.0003 1.0016 1.0088 1.0005 1.0118 1.0102
dispcorr: -0.012761271 hartree
energy: -1032.064810469246
dipole: 1.02196 -4.89612 -3.87416 0.30668 -0.26980 0.03689 5.71852 -5.45489 0.26363
magnitude: 3.88329 au
magnitude: 9.87054 debye
temp: 298.15 k
press: 1.00 atm
zeropoint: 0.25854198 hartree
thermalvibcorrection: 0.01351395 hartree
thermalrotcorrection: 0.00141627 hartree
thermaltrasncorrection: 0.00141627 hartree
thermaltotal: -1031.78992200 hartree
thermalcorr: 0.01634649 hartree
nonthermalcorr: 0.25854198 hartree
totalcorr: 0.27488847 hartree
thermalcorrenthalpy: 0.00094421 hartree
totalenthalpy: -1031.78897779 hartree
totalentropycorr: -0.06044143 hartree
gibbsenthalpy: -1031.84941922 hartree
gibbsminuselec: 0.21539125 hartree
