program: Orca
programVersion: 5.0.3
elementType: C C C C C C H H H H H C H H C H C H H H N H H C H H H
charge: 1
multiplicity: 1
keywords: wB97X-D3 TightOpt Freq def2-TZVPP def2/J RIJCOSX TightSCF defgrid3 CHELPG
frequency: 0.00 0.00 0.00 0.00 0.00 0.00 54.56 81.01 98.52 139.15 212.17 255.05 287.51 292.94 311.33 385.82 410.19 425.92 506.34 513.97 638.79 650.32 728.96 740.49 787.76 813.07 849.84 889.75 904.18 929.83 972.74 995.28 1027.74 1031.47 1048.24 1055.29 1067.25 1083.51 1113.55 1127.20 1166.42 1189.35 1197.31 1215.03 1240.83 1266.64 1336.76 1343.14 1368.62 1380.48 1405.21 1414.78 1433.25 1457.08 1469.55 1492.46 1497.56 1503.03 1507.46 1513.07 1520.24 1551.89 1639.74 1666.30 1686.93 3073.75 3076.82 3104.56 3109.18 3130.17 3155.27 3160.19 3170.37 3196.44 3205.18 3213.28 3221.78 3224.36 3233.16 3469.38 3540.07
frequency: 54.56 81.01 98.52 139.15 212.17 255.05 287.51 292.94 311.33 385.82 410.19 425.92 506.34 513.97 638.79 650.32 728.96 740.49 787.76 813.07 849.84 889.75 904.18 929.83 972.74 995.28 1027.74 1031.47 1048.24 1055.29 1067.25 1083.51 1113.55 1127.20 1166.42 1189.35 1197.31 1215.03 1240.83 1266.64 1336.76 1343.14 1368.62 1380.48 1405.21 1414.78 1433.25 1457.08 1469.55 1492.46 1497.56 1503.03 1507.46 1513.07 1520.24 1551.89 1639.74 1666.30 1686.93 3073.75 3076.82 3104.56 3109.18 3130.17 3155.27 3160.19 3170.37 3196.44 3205.18 3213.28 3221.78 3224.36 3233.16 3469.38 3540.07
formula: C10H16N
InChI: InChI=1S/C10H16N/c1-9(11-2)8-10-6-4-3-5-7-10/h3-7,9H,8,11H2,1-2H3
27 atoms
C  -2.900229 -0.139528 -0.530308
C  -2.214036 1.026426 -0.841295
C  -1.011204 1.316486 -0.216323
C  -0.474281 0.441898 0.725176
C  -1.188711 -0.70786 1.05438
C  -2.391436 -1.002594 0.427409
H  -3.840656 -0.361684 -1.016767
H  -2.623102 1.71838 -1.565818
H  -0.496226 2.240352 -0.452194
H  -0.824643 -1.366101 1.838705
H  -2.938159 -1.895588 0.700679
C  0.877372 0.686351 1.34513
H  0.93144 0.174108 2.308701
H  1.02642 1.746202 1.554673
C  2.068508 0.233524 0.484296
H  2.93838 0.149142 1.136996
C  2.414966 1.144937 -0.675215
H  3.270177 0.777942 -1.243774
H  1.576618 1.294181 -1.353722
H  2.692092 2.116807 -0.270022
N  1.833552 -1.204225 0.003229
H  2.723153 -1.696803 0.024846
H  1.233682 -1.661176 0.690522
C  1.217524 -1.411453 -1.342582
H  1.053603 -2.478018 -1.474036
H  0.271112 -0.882389 -1.386306
H  1.896923 -1.045717 -2.105051
totalener: -445.25797668 hartree
nucrepener: 628.90015609 hartree
electener: -1074.15813277 hartree
oneelecener: -1833.71674810 hartree
twoeener: 759.55861533 hartree
kineticenergy: 442.72545878 hartree
xcener: -45.581000784176 hartree
chargesum: 1.0000000
charge: -0.136506 -0.084391 -0.238400 0.119832 -0.300783 -0.088506 0.153187 0.152605 0.143683 0.138427 0.152797 -0.180527 0.138811 0.122762 0.014726 0.122152 -0.273477 0.110807 0.107104 0.120987 0.089492 0.177949 0.183317 -0.192970 0.152167 0.153087 0.141664
charge: 0.008024 0.007394 -0.009283 -0.100692 -0.030270 0.001999 0.031834 0.032197 0.027291 0.020398 0.030984 0.000312 0.039476 0.049740 -0.054341 0.036850 0.029340 0.023425 0.023397 0.039164 0.536748 0.044939 0.043390 0.083008 0.027697 0.031227 0.025753
qa: -0.1365 -0.0844 -0.2384 0.1198 -0.3008 -0.0885 0.1532 0.1526 0.1437 0.1384 0.1528 -0.1805 0.1388 0.1228 0.0147 0.1222 -0.2735 0.1108 0.1071 0.1210 0.0895 0.1779 0.1833 -0.1930 0.1522 0.1531 0.1417
va: 3.9994 3.9423 4.0028 3.3692 3.9917 3.9681 0.9959 0.9963 0.9997 1.0082 0.9960 3.8272 1.0036 1.0153 3.8266 0.9962 3.9527 1.0075 0.9981 1.0067 3.6616 0.9912 1.0098 3.8448 0.9940 0.9969 0.9925
dispcorr: -0.011618754 hartree
energy: -445.270910911201
dipole: 9.21212 -6.66189 2.55024 -1.20742 -0.11915 -1.32657 -2.70934 2.45261 -0.25673
magnitude: 2.88607 au
magnitude: 7.33581 debye
temp: 298.15 k
press: 1.00 atm
zeropoint: 0.24872305 hartree
thermalvibcorrection: 0.00799348 hartree
thermalrotcorrection: 0.00141627 hartree
thermaltrasncorrection: 0.00141627 hartree
thermaltotal: -445.01136184 hartree
thermalcorr: 0.01082602 hartree
nonthermalcorr: 0.24872305 hartree
totalcorr: 0.25954907 hartree
thermalcorrenthalpy: 0.00094421 hartree
totalenthalpy: -445.01041763 hartree
totalentropycorr: -0.04727445 hartree
gibbsenthalpy: -445.05769208 hartree
gibbsminuselec: 0.21321883 hartree
