program: Orca
programVersion: 5.0.3
elementType: C C C O C C C C C N C O C C C C C C C C H H H H H H H H H H H H H H H H H H H H
charge: 1
multiplicity: 1
keywords: wB97X-D3 TightOpt Freq def2-TZVPP def2/J RIJCOSX TightSCF defgrid3 CHELPG
frequency: 0.00 0.00 0.00 0.00 0.00 0.00 7.64 33.81 46.56 59.24 62.73 80.82 115.57 155.60 171.94 183.22 207.57 208.21 229.31 237.12 263.05 295.20 312.47 350.76 375.36 398.28 433.79 446.80 461.65 468.48 505.31 509.38 561.15 566.53 597.66 606.26 618.11 683.01 709.28 722.50 734.79 756.75 771.74 807.18 817.69 826.32 864.88 867.41 902.31 919.05 936.72 943.91 952.12 963.64 1011.39 1015.80 1017.65 1029.06 1029.76 1056.98 1069.35 1089.78 1120.95 1129.54 1154.96 1169.90 1177.21 1192.26 1201.00 1205.16 1221.19 1239.61 1249.60 1308.72 1325.97 1327.62 1337.08 1372.17 1375.52 1391.05 1396.83 1423.91 1433.39 1434.81 1479.21 1486.38 1491.21 1499.72 1503.46 1506.47 1509.60 1515.99 1543.78 1554.13 1566.98 1651.11 1658.92 1680.81 1693.88 1725.82 3045.10 3053.09 3068.23 3073.93 3129.09 3145.43 3151.85 3157.85 3161.73 3168.12 3202.99 3210.55 3218.98 3224.69 3231.98 3235.51 3238.56 3239.41 3625.96 3843.93
frequency: 7.64 33.81 46.56 59.24 62.73 80.82 115.57 155.60 171.94 183.22 207.57 208.21 229.31 237.12 263.05 295.20 312.47 350.76 375.36 398.28 433.79 446.80 461.65 468.48 505.31 509.38 561.15 566.53 597.66 606.26 618.11 683.01 709.28 722.50 734.79 756.75 771.74 807.18 817.69 826.32 864.88 867.41 902.31 919.05 936.72 943.91 952.12 963.64 1011.39 1015.80 1017.65 1029.06 1029.76 1056.98 1069.35 1089.78 1120.95 1129.54 1154.96 1169.90 1177.21 1192.26 1201.00 1205.16 1221.19 1239.61 1249.60 1308.72 1325.97 1327.62 1337.08 1372.17 1375.52 1391.05 1396.83 1423.91 1433.39 1434.81 1479.21 1486.38 1491.21 1499.72 1503.46 1506.47 1509.60 1515.99 1543.78 1554.13 1566.98 1651.11 1658.92 1680.81 1693.88 1725.82 3045.10 3053.09 3068.23 3073.93 3129.09 3145.43 3151.85 3157.85 3161.73 3168.12 3202.99 3210.55 3218.98 3224.69 3231.98 3235.51 3238.56 3239.41 3625.96 3843.93
formula: C17H20NO2
InChI: InChI=1S/C17H20NO2/c1-12(2)20-15-9-6-8-14(11-15)18-17(19)16-10-5-4-7-13(16)3/h4-12,18-19H,1-3H3
40 atoms
C  -5.427149 -1.44741 1.630955
C  -4.170185 -1.323167 0.796805
C  -4.109228 -2.347067 -0.323148
O  -4.188517 0.008462 0.255407
C  -3.073095 0.584552 -0.202545
C  -3.231342 1.854034 -0.770972
C  -2.147542 2.54673 -1.261544
C  -0.867749 2.003901 -1.20642
C  -0.726495 0.757853 -0.635748
N  0.569976 0.131171 -0.584257
C  1.658236 0.617625 -0.060579
O  1.55869 1.75981 0.556627
C  2.935458 -0.092681 -0.184392
C  3.26409 -0.612606 -1.440166
C  4.45911 -1.276653 -1.626303
C  5.32024 -1.433057 -0.550386
C  4.987688 -0.92714 0.695758
C  3.799084 -0.240945 0.913584
C  3.483492 0.268822 2.296847
C  -1.797679 0.028573 -0.13526
H  -5.475384 -2.434816 2.0894
H  -6.310397 -1.313789 1.006258
H  -5.44427 -0.697299 2.419973
H  -3.298699 -1.415586 1.453757
H  -4.99655 -2.264363 -0.950936
H  -4.075725 -3.354237 0.092266
H  -3.233258 -2.213213 -0.958218
H  -4.228228 2.271116 -0.814734
H  -2.293597 3.523247 -1.703237
H  -0.017691 2.537567 -1.607197
H  0.64891 -0.798246 -0.969995
H  2.598217 -0.45921 -2.280918
H  4.71904 -1.663565 -2.601799
H  6.258351 -1.956484 -0.680637
H  5.66397 -1.075524 1.528069
H  4.033172 -0.305504 3.039046
H  2.425099 0.196312 2.545616
H  3.794732 1.309678 2.426029
H  -1.626605 -0.945134 0.300509
H  2.418622 2.067298 0.861658
totalener: -864.90837282 hartree
nucrepener: 1456.81146174 hartree
electener: -2321.71983457 hartree
oneelecener: -4045.96169568 hartree
twoeener: 1724.24186111 hartree
kineticenergy: 860.36937779 hartree
xcener: -84.922133581040 hartree
chargesum: 1.0000000
charge: -0.222000 0.102055 -0.240498 -0.270873 0.301960 -0.184998 -0.065361 -0.192902 0.124464 -0.117237 0.474740 -0.188950 0.034518 -0.219908 -0.109482 -0.096417 -0.058594 -0.121246 -0.247667 -0.220077 0.086188 0.095887 0.098246 0.056267 0.102183 0.097769 0.078027 0.140668 0.145060 0.130749 0.193720 0.154496 0.155863 0.157510 0.135141 0.107010 0.124530 0.103366 0.114213 0.241580
charge: 0.020198 -0.175646 0.014116 0.326166 -0.201620 0.024641 0.012113 -0.014854 -0.133629 0.424947 -0.186406 0.480879 -0.095484 0.018215 0.015485 0.040944 0.025569 -0.054033 0.033222 -0.016013 0.022312 0.022544 0.019111 0.014288 0.024896 0.023088 0.008547 0.036115 0.034138 0.024034 0.027702 0.031907 0.035242 0.038598 0.036572 0.036262 0.024152 0.024327 0.018606 -0.061253
qa: -0.2220 0.1021 -0.2405 -0.2709 0.3020 -0.1850 -0.0654 -0.1929 0.1245 -0.1172 0.4747 -0.1890 0.0345 -0.2199 -0.1095 -0.0964 -0.0586 -0.1212 -0.2477 -0.2201 0.0862 0.0959 0.0982 0.0563 0.1022 0.0978 0.0780 0.1407 0.1451 0.1307 0.1937 0.1545 0.1559 0.1575 0.1351 0.1070 0.1245 0.1034 0.1142 0.2416
va: 3.9338 3.8659 3.9043 2.1625 3.9658 4.0372 3.9792 4.0667 3.7061 3.4611 3.8845 2.3441 3.5106 4.0437 4.0020 4.0012 3.9300 3.8849 3.9242 3.9845 1.0072 1.0096 1.0110 0.9971 1.0099 1.0096 1.0067 1.0120 0.9967 1.0139 0.9974 1.0102 0.9974 0.9938 1.0043 1.0066 0.9955 0.9950 1.0256 1.0141
dispcorr: -0.016545797 hartree
energy: -864.928029389218
dipole: -8.63097 11.38121 2.75025 -9.00621 8.69795 -0.30827 5.90749 -5.76382 0.14367
magnitude: 2.77120 au
magnitude: 7.04382 debye
temp: 298.15 k
press: 1.00 atm
zeropoint: 0.34115919 hartree
thermalvibcorrection: 0.01614727 hartree
thermalrotcorrection: 0.00141627 hartree
thermaltrasncorrection: 0.00141627 hartree
thermaltotal: -864.56789039 hartree
thermalcorr: 0.01897982 hartree
nonthermalcorr: 0.34115919 hartree
totalcorr: 0.36013900 hartree
thermalcorrenthalpy: 0.00094421 hartree
totalenthalpy: -864.56694618 hartree
totalentropycorr: -0.06548168 hartree
gibbsenthalpy: -864.63242786 hartree
gibbsminuselec: 0.29560153 hartree
