program: Orca
programVersion: 5.0.3
elementType: O O O O N N C C C C C C C C C H H H H H H H H H H H H H H H H H H H
charge: 1
multiplicity: 1
keywords: wB97X-D3 TightOpt Freq def2-TZVPP def2/J RIJCOSX TightSCF defgrid3 CHELPG
frequency: 0.00 0.00 0.00 0.00 0.00 0.00 27.84 36.67 66.83 80.61 94.93 104.10 137.74 151.65 191.62 228.51 231.45 243.92 266.12 285.66 306.73 316.07 328.65 379.37 385.32 397.55 468.32 479.17 498.98 582.81 589.04 594.39 605.90 656.55 686.63 749.42 779.70 790.26 797.95 866.52 875.78 899.15 918.56 940.47 955.24 992.72 1022.33 1066.65 1074.36 1102.58 1110.19 1121.96 1136.19 1146.95 1156.58 1204.81 1232.11 1271.33 1295.38 1320.37 1334.96 1338.62 1358.34 1369.54 1397.05 1416.83 1421.50 1430.48 1438.88 1482.35 1488.20 1498.59 1504.38 1506.07 1507.36 1510.11 1518.17 1523.83 1568.49 1612.42 1650.04 1723.21 1763.83 2322.76 3043.31 3059.97 3069.25 3072.74 3081.67 3093.29 3108.93 3117.76 3134.72 3144.76 3148.54 3160.63 3165.64 3177.49 3638.05 3652.88 3765.16 3782.34
frequency: 27.84 36.67 66.83 80.61 94.93 104.10 137.74 151.65 191.62 228.51 231.45 243.92 266.12 285.66 306.73 316.07 328.65 379.37 385.32 397.55 468.32 479.17 498.98 582.81 589.04 594.39 605.90 656.55 686.63 749.42 779.70 790.26 797.95 866.52 875.78 899.15 918.56 940.47 955.24 992.72 1022.33 1066.65 1074.36 1102.58 1110.19 1121.96 1136.19 1146.95 1156.58 1204.81 1232.11 1271.33 1295.38 1320.37 1334.96 1338.62 1358.34 1369.54 1397.05 1416.83 1421.50 1430.48 1438.88 1482.35 1488.20 1498.59 1504.38 1506.07 1507.36 1510.11 1518.17 1523.83 1568.49 1612.42 1650.04 1723.21 1763.83 2322.76 3043.31 3059.97 3069.25 3072.74 3081.67 3093.29 3108.93 3117.76 3134.72 3144.76 3148.54 3160.63 3165.64 3177.49 3638.05 3652.88 3765.16 3782.34
formula: C9H19N2O4
InChI: InChI=1S/C9H19N2O4/c1-3-4-9(2,5-14-7(10)12)6-15-8(11)13/h12H,3-6,10-11H2,1-2H3
34 atoms
O  -1.008626 1.361022 0.725382
O  1.919157 -1.282898 -0.443567
O  0.892607 2.231989 -0.154744
O  2.84507 0.788049 -0.158534
N  -1.018015 3.407445 -0.098062
N  4.066549 -1.056263 0.011359
C  -0.474688 -0.997527 0.137791
C  -1.816211 -0.979442 -0.624318
C  -0.400336 0.138274 1.167248
C  0.60923 -0.873282 -0.936224
C  -0.290516 -2.315545 0.897308
C  -3.083404 -1.005527 0.226481
C  -4.336549 -1.00134 -0.64033
C  -0.299836 2.314451 0.147688
C  2.90238 -0.476247 -0.205725
H  -1.849418 -0.096829 -1.271414
H  -1.827121 -1.844735 -1.293842
H  -0.97739 -0.133333 2.047942
H  0.622297 0.335419 1.494528
H  0.41638 -1.58105 -1.739247
H  0.677347 0.125214 -1.364279
H  0.623418 -2.319416 1.491847
H  -0.240686 -3.156138 0.204439
H  -1.123973 -2.48957 1.574743
H  -3.106909 -0.142312 0.895216
H  -3.091498 -1.893656 0.861668
H  -4.364786 -1.87121 -1.298523
H  -4.380624 -0.109236 -1.267821
H  -5.237079 -1.020881 -0.027881
H  -1.974562 3.469054 0.197229
H  -0.570853 4.196215 -0.526883
H  4.159553 -2.052615 -0.07311
H  4.865886 -0.491323 0.238056
H  1.9279 1.293335 -0.150094
totalener: -764.73885487 hartree
nucrepener: 1144.13203717 hartree
electener: -1908.87089204 hartree
oneelecener: -3297.32619224 hartree
twoeener: 1388.45530020 hartree
kineticenergy: 760.95523954 hartree
xcener: -71.732068969625 hartree
chargesum: 1.0000000
charge: -0.270810 -0.239486 -0.433478 -0.273071 -0.239958 -0.210182 0.251303 -0.220980 -0.154434 -0.137483 -0.324003 -0.117306 -0.255247 0.524453 0.536067 0.090027 0.100497 0.147377 0.127064 0.151376 0.144637 0.102654 0.114566 0.115021 0.071226 0.077579 0.084390 0.076704 0.100757 0.192430 0.198225 0.205057 0.210856 0.254173
charge: 0.327736 0.359832 0.196343 0.416150 0.394937 0.422405 -0.181773 -0.012902 -0.050144 -0.018479 0.035848 -0.036318 0.010818 -0.526214 -0.451859 0.027444 0.033593 0.038035 0.019587 0.038790 0.020761 0.016881 0.028557 0.023269 0.016546 0.018609 0.015427 0.012433 0.017394 -0.006450 -0.001819 0.006626 0.010137 -0.222203
qa: -0.2708 -0.2395 -0.4335 -0.2731 -0.2400 -0.2102 0.2513 -0.2210 -0.1544 -0.1375 -0.3240 -0.1173 -0.2552 0.5245 0.5361 0.0900 0.1005 0.1474 0.1271 0.1514 0.1446 0.1027 0.1146 0.1150 0.0712 0.0776 0.0844 0.0767 0.1008 0.1924 0.1982 0.2051 0.2109 0.2542
va: 2.1223 2.2003 2.0744 2.2563 3.3202 3.3689 3.6402 3.8406 3.8730 3.8040 3.9468 3.8726 3.9739 4.2877 4.2723 1.0141 1.0138 1.0008 1.0172 1.0094 1.0161 1.0088 1.0041 1.0076 1.0117 1.0084 1.0032 1.0019 1.0059 1.0115 1.0080 1.0041 1.0000 1.1171
dispcorr: -0.016684025 hartree
energy: -764.757580785286
dipole: -15.64644 17.19870 1.55226 -9.95424 9.89739 -0.05685 -0.03367 0.03454 0.00087
magnitude: 1.55330 au
magnitude: 3.94818 debye
temp: 298.15 k
press: 1.00 atm
zeropoint: 0.29696779 hartree
thermalvibcorrection: 0.01398736 hartree
thermalrotcorrection: 0.00141627 hartree
thermaltrasncorrection: 0.00141627 hartree
thermaltotal: -764.44379310 hartree
thermalcorr: 0.01681990 hartree
nonthermalcorr: 0.29696779 hartree
totalcorr: 0.31378769 hartree
thermalcorrenthalpy: 0.00094421 hartree
totalenthalpy: -764.44284889 hartree
totalentropycorr: -0.06005350 hartree
gibbsenthalpy: -764.50290239 hartree
gibbsminuselec: 0.25467840 hartree
