program: Gaussian 09
title: 000044837
version: EM64L-G09RevD.01
frameworkgroup: C1[X(C12H10N2O2)]
method: RPBEPBE
basis: SDD
operation: Freq
keyword: #p
keyword: freq=noraman
keyword: PBEPBE/SDD
title: #p freq=noraman PBEPBE/SDD
converged: YES YES NO NO
title: Mulliken charges:
elementType: O O N N C C C C C C C C C C C C H H H H H H H H H H
charge: -0.284909 -0.253411 -0.000409 0.000565 0.456271 -0.408390 -0.304369 0.208614 -0.491631 0.223067 -0.258140 -0.176858 -0.418300 -0.326687 -0.179399 -0.315899 0.237284 0.256024 0.253006 0.250799 0.279991 0.234495 0.282985 0.245832 0.240069 0.249400
chargesum: 0.00000
title: Mulliken charges with hydrogens summed into heavy atoms:
elementType: O O N N C C C C C C C C C C C C
charge: -0.284909 -0.253411 -0.000409 0.000565 0.456271 0.084918 -0.051363 0.208614 -0.240832 0.223067 0.021851 0.057637 -0.135315 -0.080855 0.060670 -0.066500
polarizability: 2.08005831e+02 -4.11558780e+00 1.37135945e+02 -1.44697719e+01 -3.63082355e+00 8.89193060e+01
1716.lowfreq: -16.0958 -10.9244 -1.9783 -0.0006 -0.0002 0.0006 4.7516 18.0525 42.7205
frequency: -15.3590 17.7336 42.6740 54.6012 113.1944 142.0666 194.9816 229.1287 239.8551 298.5963 373.7463 377.1132 395.3191 429.6499 445.5504 513.0232 582.6235 608.4485 622.8702 688.1155 696.3843 719.3738 720.9914 784.7758 800.2531 833.3204 843.4203 896.6183 922.1344 938.5984 942.5451 968.3755 983.9650 994.2554 998.1250 1007.2411 1011.8834 1022.4875 1029.0741 1069.7533 1108.0089 1114.7999 1193.6537 1196.5488 1204.9617 1240.0219 1246.7868 1309.7196 1311.4283 1327.7012 1332.0739 1362.7154 1408.3879 1417.5276 1455.5702 1463.3828 1474.0068 1550.4836 1559.4695 1585.0359 1591.1826 1618.7526 3004.9735 3067.8618 3114.1744 3134.3310 3137.0734 3145.5059 3155.2210 3164.1659 3169.6846 3175.5543
redmass: 4.9975 4.8224 6.1029 5.9707 4.7997 5.1405 4.4441 7.4585 3.6973 3.7155 3.2318 3.3758 3.6149 4.8076 4.7546 5.6293 6.5742 7.9191 7.1552 7.3990 7.2534 1.8379 1.9929 6.8363 1.7872 1.7196 4.0178 6.1846 1.4407 1.4028 1.3677 1.5005 1.7384 1.7353 3.5771 1.3806 3.2911 4.2811 2.9520 3.5892 1.6122 1.5799 1.3656 1.3281 1.1275 2.0435 2.7063 8.8829 11.0972 1.2907 1.3166 1.3740 2.1325 2.0266 2.1404 2.1950 1.1082 5.9068 5.6191 5.8976 5.8419 11.4155 1.0574 1.1060 1.0914 1.0881 1.0888 1.0921 1.0914 1.0927 1.1002 1.1004
irintensity: 0.2194 2.4905 0.0095 6.1585 1.9816 0.6598 6.2680 4.2253 4.9965 11.2436 1.5835 1.9062 1.1087 2.7886 2.6575 5.0290 2.9028 1.8215 6.8598 0.9748 5.6377 64.0692 29.3441 0.4657 43.5369 21.8409 12.6267 41.7711 0.7371 0.7623 1.0323 1.9811 4.1310 7.6754 58.4889 0.6685 13.1397 11.9119 0.9369 324.2920 8.8128 4.3828 0.7450 6.8263 4.8005 38.2422 326.0973 1.0823 1.2823 4.9171 13.0743 9.7442 29.8012 14.7805 13.5969 22.9220 7.6985 0.2469 8.4942 33.3025 0.6656 221.7956 15.0791 13.6129 23.2030 3.3031 10.2661 19.0056 6.9816 5.9117 18.7561 16.7385
temp: 298.150 k
press: 1.00000 atm
elementType: 8 8 7 7 6 6 6 6 6 6 6 6 6 6 6 6 1 1 1 1 1 1 1 1 1 1
symmnumber: 1
zpe: 513758.0 jmol-1
zpe.correction: 0.195680 hartree
zpe.thermalcorrener: 0.208168 hartree
zpe.thermalcorrenthalpy: 0.209112 hartree
zpe.thermalcorrgfe: 0.154268 hartree
zpe.sumelectzpe: -722.089959 hartree
zpe.sumelectthermal: -722.077471 hartree
zpe.sumelectthermalent: -722.076527 hartree
zpe.sumelectthermalfe: -722.131371 hartree
dipole: -1.9515 0.1309 1.9433
dipole: 2.7571
quadrupole: -87.1263 -97.8011 -92.6153
quadrupole: -4.9508 3.8457 -7.0341
quadrupole: 5.3879 -5.2868 -0.1011 -4.9508 3.8457 -7.0341
hfenergy: -722.2856395 hartree
pointgroup: C01 [X(C12H10N2O2)]
dipole: -0.750956 -0.2054174 -0.7553229 debye
dipolederiv: -2.0029256 -0.1231111 -0.1368961 -0.2105037 -0.4701175 -0.0483441 -0.1685951 -0.0147268 -0.2763914 -0.8011286 0.0939479 -0.0327522 -0.13774 -1.0063927 -0.0406138 -0.0717918 -0.0349126 -0.3248931 -0.3769245 -0.0338156 0.0017445 -0.0757689 -0.2843946 0.047873 -0.0017743 0.0440441 -0.3141047 -0.5516247 0.0421208 -0.0471256 0.0674245 -0.2906171 0.0015293 -0.0534977 0.0031593 -0.2569364 0.0718406 0.1130317 -0.1040641 0.1231337 -0.0072534 0.0569829 -0.0048821 0.1203303 -0.1591909 1.0437874 0.0071494 0.0056953 -0.3380079 0.2260581 -0.017599 -0.1233098 -0.0802072 0.3351277 0.0711299 0.0399486 0.0799965 -0.0172063 -0.0740548 -0.0573515 0.0522486 -0.0611088 0.0525246 -0.5386821 0.201307 -0.0622173 0.1201734 -0.3129341 -0.0042427 -0.1237232 0.0030581 0.0049965 0.0353584 -0.0158366 0.1089408 0.0696791 0.0415611 -0.1327979 0.0470593 -0.1839935 0.2269998 2.1950955 -0.1909858 0.2175972 0.2640531 1.2981233 0.0668671 0.390076 0.0576003 0.2798656 0.1838062 -0.1428056 0.0347107 0.1064839 0.1176406 0.0284315 0.0598231 -0.0112928 -0.0699058 -0.2484559 -0.0690696 0.0108342 -0.0038454 -0.0539961 -0.0784504 -0.1048385 -0.1184008 0.0221641 0.249687 0.0031899 0.0581462 -0.0485711 0.2051795 0.0220779 0.0640767 0.0201893 -0.0105328 0.277334 0.2016874 -0.0525567 0.1158258 0.04434 -0.1127971 0.0853012 -0.0450144 0.0659621 0.0175998 0.1123869 0.0389299 0.2605324 -0.3155004 0.0240157 0.0487666 0.0061603 -0.0985822 0.2776101 -0.024727 0.0668655 -0.1930961 0.2943881 -0.0039747 0.0480324 0.0281551 -0.0415117 -0.0588394 0.0263879 -0.0320329 0.0654552 0.0596728 0.0449268 0.0075939 0.0870273 -0.0821843 -0.0273958 -0.0702543 -0.0152911 0.0989866 0.0178898 -0.0435665 0.0100954 -0.070948 0.0302399 0.0190797 -0.0102472 -0.0990365 -0.0061299 0.1147462 0.0109105 -0.124118 0.0070381 0.0499605 0.0983255 -0.0383939 0.0300861 -0.0418458 0.0497483 0.1065061 0.0354407 0.1086266 -0.0320076 0.152271 0.0041293 -0.0035165 -0.036567 0.0007705 -0.0200743 -0.0020777 -0.0132116 0.1438797 0.0921531 -0.0235415 -0.0044752 -0.0409793 0.073696 0.1146882 0.0250163 0.1178261 -0.0289325 0.004983 -0.0297755 -0.0297344 -0.0835827 0.1052625 -0.0100638 -0.0419558 -0.001524 0.1168914 -0.0481242 -0.1101602 0.0442886 -0.1039522 0.0595589 0.0549388 0.0286006 0.0432233 0.086346 -0.0826219 -0.0447196 -0.0497036 -0.0633543 0.0747506 -0.0214743 -0.0542508 -0.0165735 0.1490708 -0.0533386 0.082157 -0.028433 0.1094033 0.0318745 0.0116023 -0.0273161 0.0054757 0.1311446 unknown
polarizability: 207.4557872|5.9168722|132.7389903|16.1939003|-14.0605265|93.8663046 unknown
InChI: InChI=1S/C12H10N2O2/c15-12(11-4-2-6-14-8-11)16-9-10-3-1-5-13-7-10/h1-8H,9H2
charge 0 multiplicity 1
26 atoms
O  0.04582 -0.498908 0.395141
O  -1.227755 -2.420563 0.013435
N  4.741793 0.196788 0.840929
N  -3.207907 2.043619 0.026626
C  2.474357 -0.516517 0.220273
C  1.264062 -1.353769 0.55074
C  2.553263 0.243851 -0.973442
C  -2.297362 -0.230098 -0.00898
C  3.592761 -0.497503 1.090014
C  -1.150052 -1.172396 0.126727
C  -3.57806 -0.759414 -0.311197
C  3.728792 0.974707 -1.244835
C  -2.163514 1.174867 0.152982
C  4.795613 0.919421 -0.316281
C  -4.665021 0.127384 -0.442838
C  -4.433965 1.513208 -0.268211
H  1.292681 -1.719098 1.592726
H  1.151905 -2.226219 -0.119765
H  1.704099 0.269517 -1.664685
H  3.574896 -1.061433 2.031646
H  -3.69227 -1.84121 -0.434707
H  3.823241 1.576192 -2.154254
H  -1.190508 1.613048 0.393605
H  5.725956 1.471104 -0.492407
H  -5.669326 -0.238985 -0.675311
H  -5.252297 2.235808 -0.364733
